{"text_format":"1","workbook":"xlsx","n_sheets":9,"sheets":["1. Vejledning","2. Stamoplysninger","3. Budget","4. Regnskab","5. Redegørelse","6.Statusrapport","7. Delbudget (bilag)","Data","Logo"],"not_rendered":{"charts":0,"images":40,"macros":1,"external_links":0,"defined_names":48,"comments":2,"pivot_tables":0},"unopened":[],"bounds":{"document_bytes":16777216,"sheet_cells":100000,"rows_first":2000,"rows_last":500,"rows_between":2000,"halvings":0,"cell_chars":16384,"cell_head_chars":4096},"cells_cut":0,"cells_raw":0,"read":"whole","date_system":"1900"}

{"sheet":"1. Vejledning","index":0,"n_rows":24,"n_cols":4,"rows_kept":24,"cut":false,"hidden":false,"merged":[]}
[]
["KORT VEJLEDNING I BRUG AF SKEMAET"]
[]
[null,"Introduktion"]
[]
[null,"2. Stamoplysninger"]
[]
[null,"3. Budget"]
[]
[null,"4. Regnskab"]
[]
[null,"5. Redegørelse"]
[]
[null,"6. Statusrapport"]
[]
[null,"7. Delbudget (bilag)"]
[]
[]
[]
[]
[]
[]
[]
[null,null,null,"Version 1.05 gældende fra 07-06-2023"]

{"sheet":"2. Stamoplysninger","index":1,"n_rows":56,"n_cols":7,"rows_kept":56,"cut":false,"hidden":false,"merged":[]}
[null,null,null,null,null," "]
[null,"STAMOPLYSNINGER, STØRRE ARKÆOLOGISK FORUNDERSØGELSE"]
[]
[null,null,"Stedoplysninger",null,"(udfyld her)"]
[null,null,null,"Systemnr. fra Fund og Fortidsminder"]
[]
[null,null,null,"Lokalitetsnavn"]
[null,null,null,"Sted- og lok. nr."]
[null,null,null,"Matrikler"]
[null,null,null,"Ejerlav"]
[null,null,null,"Kommune","Vælg","˅"]
[null,null,null,"Museets journalnummer"]
[null,null,null,"Museum","Vælg","˅"]
[]
[null,null,null,"Styrelsens j. nr., oplyses i afgørelsen"]
[]
[null,null,"Til beregning af udgifter"]
[null,null,null,"Areal der skal forundersøges",0,"m²","˅"]
[null,null,null,"Dækningsgrad, anbefalet 20 %",0.2]
[null,null,null,"Fremdrift, m² søgegrøft pr. dag",1700,{"$f":"F18","v":"m²"}]
[]
[null,null,"Landskab"]
[null,null,null,"Kulturarvsareal","Vælg","˅"]
[null,null,null,"Topografi","Vælg","˅"]
[]
[null,null,"Identifikation af bygherre"]
[null,null,null,"Bygherretype","Vælg","˅"]
[]
[null,"    ",null,"CVR-nummer"]
[null,null,null,"P-nummer"]
[null,null,null,"Navn virksomhed/person"]
[]
[null,null,null,"Vejnavn og nr."]
[null,null,null,"Postnummer og by"]
[null,null,null,"Land"]
[null,null,null,"Telefon"]
[null,null,null,"e-mail"]
[]
[null,null,"Bygherres kontaktperson"]
[null,"    ",null,"CVR-nummer"]
[null,null,null,"P-nummer"]
[null,null,null,"Navn virksomhed/person"," "]
[]
[null,null,null,"Vejnavn og nr."]
[null,null,null,"Postnummer og by"]
[null,null,null,"Land"]
[null,null,null,"Telefon"]
[null,null,null,"e-mail"]
[]
[null,null,"Øvrige oplysninger"]
[null,null,null,"Årsag","Vælg","˅"]
[null,null,null,"Bygherres samlede projektareal",null,"m²"]
[null,null,null,"Bygherres samlede anlægsomkostninger",null,"kr. inkl. moms"]
[]
[]
[null,null,"Besked til sagsbehandler vedr. budgettet"]

{"sheet":"3. Budget","index":2,"n_rows":102,"n_cols":9,"rows_kept":102,"cut":false,"hidden":false,"merged":[[2,4,5,7]]}
["BUDGET FOR STØRRE ARKÆOLOGISK FORUNDERSØGELSE"]
[{"$f":"'2. Stamoplysninger'!E7","v":0}]
[{"$f":"'2. Stamoplysninger'!E13","v":"Vælg"}]
["Museets j.nr.",null,{"$f":"'2. Stamoplysninger'!E12","v":0}]
["Sted- lok. nr.",null,{"$f":"'2. Stamoplysninger'!E8","v":0}]
["SLKS j. nr.",null,{"$f":"'2. Stamoplysninger'!E15","v":0}]
[]
["Bygherre:",null,{"$f":"'2. Stamoplysninger'!E29","v":0}]
[null,null,{"$f":"'2. Stamoplysninger'!E31","v":0}]
[null,null,{"$f":"'2. Stamoplysninger'!E33","v":0}]
[null,null,{"$f":"'2. Stamoplysninger'!E34","v":0}]
[]
["I.  Feltarbejde",null,null,null,"(udfyld her)","(udfyld her)"]
[null,"1.","Felttimer",null,"Antal","á kr."]
[null,null,"Ansvarlig udgravningsleder",null,{"$f":"ROUNDUP(IF(OR(SUM(E16:E20)>110,E16=0),SUM(E16:E20)*0.05,5),0)","v":0},530,"=",{"$f":"E15*F15","v":0},"kr."]
[null,null,"Daglig udgravningsleder",null,{"$f":"E54","v":0},475,"=",0,"kr."]
[null,null,"Akademisk medarbejder",null,{"$f":"E54","v":0},465,"=",0,"kr."]
[null,null,"Studentermedhjælper",null,0,295,"=",0,"kr."]
[null,null,"Museumstekniker",null,0,400,"=",0,"kr."]
[null,null,"Arbejdsperson",null,0,360,"=",0,"kr."]
[null,null,"Felttimesum i alt",null,null,null,null,{"$f":"SUM(H15:H20)","v":0},"kr."]
[]
[null,"2.","Eksterne specialister",null,"Antal","á kr."]
[null,null,"Specialist",null,0,0,"=",{"$f":"E24*F24","v":0},"kr."]
[null,null,"Landmåler",null,0,0,"=",{"$f":"E25*F25","v":0},"kr."]
[null,null,"Øvrigt feltarbejde i alt",null,null,null,null,{"$f":"SUM(H24:H25)","v":0},"kr."]
[]
["II. Dokumentation og tilgængeliggørelse"]
[null,"1.","Arkæologisk beretning og kulturhistorisk"]
[null,null," rapport samt indføring og magasinering",null,"Timer"]
[null,null,null,null,null,0.2,"=",{"$f":"IF(OR(Felttimesum>F16*25,Felttimesum=0),H21*F31,F16*5)","v":0},"kr."]
[null,null,"Dokumentation i alt",null,null,null,null,{"$f":"SUM(H31)","v":0},"kr."]
[]
["III.  Personale- og transportudgifter"]
[null,"1.","Transport",null,"Km","á kr."]
[null,null,"Kørselsgodtgørelse",null,0,0,"=",{"$f":"E36*F36","v":0},"kr."]
[null,null,"Rejsegodtgørelse",null,0,0,"=",{"$f":"E37*F37","v":0},"kr."]
[null,null,"Transport i alt",null,null,null,null,{"$f":"SUM(H36:H37)","v":0},"kr."]
[]
[null,"2.","Kørsel",null,"Km","á kr."]
[null,null,"Kørsel i museets/privatbil (beregnes ud fra km pr. dag)",null,0,3.73,"=",{"$f":"(ROUNDUP(E54/7.4,0)*F41)*E41","v":0},"kr."]
[null,null,"Lejet bil",null,0,0,"=",{"$f":"E42*F42","v":0},"kr."]
[null,null,"Transport til arbejdsplads (arbejdstid)",null,0,0,"=",{"$f":"E43*F43","v":0},"kr."]
[null,null,"Kørsel i alt",null,null,null,null,{"$f":"SUM(H41:H43)","v":0},"kr."]
[]
[null,"3.","Diæter og timepenge",null,"Antal dage","á kr."]
[null,null,"Dagdiæter",null,0,0,"=",{"$f":"E47*F47","v":0},"kr."]
[null,null,"Natdiæter",null,0,0,"=",{"$f":"E48*F48","v":0},"kr."]
[null,null,"Timepenge/felttillæg",null,{"$f":"ROUNDUP(SUM(E16:E20)/7.4,0)","v":0},0,"=",{"$f":"E49*F49","v":0},"kr."]
[null,null,"Diæter og timepenge i alt",null,null,null,null,{"$f":"SUM(H47:H49)","v":0},"kr."]
[]
["IV. Øvrige udgifter"]
[null,"1.","Maskinkraft",null,"Antal timer","á kr."]
[null,null,"Afrømning",null,{"$f":"ROUNDUP(('2. Stamoplysninger'!E18*'2. Stamoplysninger'!E19/'2. Stamoplysninger'!E20)*7.4,)","v":0},900,"=",{"$f":"E54*F54","v":0},"kr."]
[null,null,"Tildækning (f.eks. 50 % af afrømning)",null,{"$f":"ROUNDUP(E54*0.5,)","v":0},900,"=",{"$f":"E55*F55","v":0},"kr."]
[null,null,"Transport",null,{"$f":"IF(E54>0,2,0)","v":0},2500,"=",{"$f":"E56*F56","v":0},"kr."]
[null,null,"Maskinkraft ialt",null,null,null,null,{"$f":"SUM(H54:H56)","v":0},"kr."]
[]
[null,"2.","Skurvogn og lign",null,"Antal","á kr."]
[null,null,"Leje inkl. drift",null,{"$f":"ROUNDUP(E54/7.4,0)","v":0},670,"=",{"$f":"E60*F60","v":0},"kr."]
{"$rows_left_out":43}
{"sheet":"4. Regnskab","index":3,"n_rows":152,"n_cols":9,"rows_kept":152,"cut":false,"hidden":false,"merged":[[2,4,5,7]]}
["REGNSKAB FOR STØRRE ARKÆOLOGISK FORUNDERSØGELSE"]
[{"$f":"'2. Stamoplysninger'!E7","v":0}]
[{"$f":"'2. Stamoplysninger'!E13","v":"Vælg"}]
["Museets j.nr.",null,{"$f":"'2. Stamoplysninger'!E12","v":0}]
["Sted- lok. nr.",null,{"$f":"'2. Stamoplysninger'!E8","v":0}]
["SLKS j. nr.",null,{"$f":"'2. Stamoplysninger'!E15","v":0}]
[]
["Bygherre:",null,{"$f":"'2. Stamoplysninger'!E29","v":0}]
[null,null,{"$f":"'2. Stamoplysninger'!E31","v":0},null,null,"Endelige areal",null,0,"m²"]
[null,null,{"$f":"'2. Stamoplysninger'!E33","v":0},null,null,"Areal af grøfter og udvidelser",null,0,{"$f":"I9","v":"m²"}]
[null,null,{"$f":"'2. Stamoplysninger'!E34","v":0},null,null,"Endelig dækningsgrad",null,{"$f":"IF(H9=0,0,H10/H9)","v":0}]
[]
["Bemærkning:",null," ",null,null,"Efterfølgende beretning",null,"Nej","˅"]
[]
[null,null,null,null,"NB! Regnskabsaflæggelse ift. styrelsen, ikke faktura."]
["I.  Feltarbejde",null,null,null,"(udfyld her)","(udfyld her)"]
[null,"1.","Felttimer",null,"Antal","á kr."]
[null,null,{"$f":"'3. Budget'!C15","v":"Ansvarlig udgravningsleder"},null,0,0,"=",{"$f":"E18*F18","v":0},"kr."]
[null,null,{"$f":"'3. Budget'!C16","v":"Daglig udgravningsleder"},null,0,0,"=",0,"kr."]
[null,null,{"$f":"'3. Budget'!C17","v":"Akademisk medarbejder"},null,0,0,"=",0,"kr."]
[null,null,{"$f":"'3. Budget'!C18","v":"Studentermedhjælper"},null,0,0,"=",0,"kr."]
[null,null,{"$f":"'3. Budget'!C19","v":"Museumstekniker"},null,0,0,"=",0,"kr."]
[null,null,{"$f":"'3. Budget'!C20","v":"Arbejdsperson"},null,0,0,"=",0,"kr."]
[null,null,"…",null,0,0,"=",0,"kr."]
[null,null,"…",null,0,0,"=",0,"kr."]
[null,null,"…",null,0,0,"=",0,"kr."]
[null,null,"…",null,0,0,"=",0,"kr."]
[null,null,"Felttimesum i alt",null,null,null,null,{"$f":"SUM(H18:H27)","v":0},"kr."]
[]
[null,"2.","Eksterne specialister",null,"Antal","á kr."]
[null,null,"Specialist",null,0,0,"=",{"$f":"E31*F31","v":0},"kr."]
[null,null,"Landmåler",null,0,0,"=",{"$f":"E32*F32","v":0},"kr."]
[null,null,"Øvrigt feltarbejde i alt",null,null,null,null,{"$f":"SUM(H31:H32)","v":0},"kr."]
[]
["II. Dokumentation og tilgængeliggørelse"]
[null,"1.","Arkæologisk beretning og kulturhistorisk"]
[null,null," rapport samt indføring og magasinering"]
[null,null,null,null,null,null,"=",{"$f":"IF(AND(H10=\"Ja\",20<Felttimesum), H28*'3. Budget'!F31,0)","v":0},"kr."]
[null,null,"Dokumentation i alt",null,null,null,null,{"$f":"SUM(H38)","v":0},"kr."]
[]
["III.  Personale- og transportudgifter"]
[null,"1.","Transport",null,"Km","á kr."]
[null,null,"Kørselsgodtgørelse",null,0,0,"=",{"$f":"E43*F43","v":0},"kr."]
[null,null,"Rejsegodtgørelse",null,0,0,"=",{"$f":"E44*F44","v":0},"kr."]
[null,null,"Transport i alt",null,null,null,null,{"$f":"SUM(H43:H44)","v":0},"kr."]
[]
[null,"2.","Kørsel",null,"Km","á kr."]
[null,null,"Kørsel i museets/privatbil",null,0,0,"=",{"$f":"E48*F48","v":0},"kr."]
[null,null,"Lejet bil",null,0,0,"=",{"$f":"E49*F49","v":0},"kr."]
[null,null,"Transport til arbejdsplads (arbejdstid)",null,0,0,"=",{"$f":"E50*F50","v":0},"kr."]
[null,null,"Kørsel i alt",null,null,null,null,{"$f":"SUM(H48:H50)","v":0},"kr."]
[]
[null,"3.","Diæter og timepenge",null,"Antal dage","á kr."]
[null,null,"Dagdiæter",null,0,0,"=",{"$f":"E54*F54","v":0},"kr."]
[null,null,"Natdiæter",null,0,0,"=",{"$f":"E55*F55","v":0},"kr."]
[null,null,"Timepenge/felttillæg",null,0,0,"=",{"$f":"E56*F56","v":0},"kr."]
[null,null,"Diæter og timepenge i alt",null,null,null,null,{"$f":"SUM(H54:H56)","v":0},"kr."]
[]
["IV. Øvrige udgifter"]
[null,"1.","Maskinkraft",null,"Antal timer","á kr."]
{"$rows_left_out":93}
{"sheet":"5. Redegørelse","index":4,"n_rows":24,"n_cols":8,"rows_kept":24,"cut":false,"hidden":false,"merged":[]}
[]
[null,"REGNSKABSREDEGØRELSE"]
[null,null,null,"Budget","Regnskab","Diskrepans"]
[null,"Areal:",null,{"$f":"'2. Stamoplysninger'!E18","v":0},{"$f":"'4. Regnskab'!H9","v":0},{"$f":"D4-E4","v":0},null,{"$f":"IF(OR(E4>D4*1.1,E4<D4*0.9),\"Vær opmærksom på, at arealet afviger mere end 10 %\",\"Ok\")","v":"Ok"}]
[]
[null,"Dækningsgrad",null,{"$f":"'2. Stamoplysninger'!E19","v":0.2},{"$f":"'4. Regnskab'!H11","v":0},{"$f":"D6-E6","v":0.2},null,{"$f":"IF(OR(E6>D6*1.1,E6<D6*0.9),\"Vær opmærksom på, at dækningsgraden afviger\",\"Ok\")","v":"Vær opmærksom på, at dækningsgraden afviger"}]
[]
[null,"I.  Feltarbejde",null,{"$f":"SUM(Felttimesum,Specialister)","v":0},{"$f":"SUM('4. Regnskab'!H28,'4. Regnskab'!H33)","v":0},{"$f":"D8-E8","v":0},null,{"$f":"IF(OR(SUM('4. Regnskab'!H28,'4. Regnskab'!H33)>SUM('3. Budget'!H21,'3. Budget'!H26)*1.2,SUM('4. Regnskab'!H28,'4. Regnskab'!H33)<SUM('3. Budget'!H21,'3. Budget'!H26)*0.8),\"Vær opmærksom på, at afvigelse overstiger 20 %\",\"Ok\")","v":"Ok"}]
[]
[null,"II. Dokumentation og tilgængeliggørelse",null,{"$f":"Rapport","v":0},{"$f":"'4. Regnskab'!H39","v":0},{"$f":"D10-E10","v":0},null,{"$f":"IF(OR(E10>D10*1.2,E10<D10*0.8),\"Vær opmærksom på, at afvigelse overstiger 20 %\",\"Ok\")","v":"Ok"}]
[]
[null,"III.  Personale- og transportudgifter",null,{"$f":"SUM(Transport_PersonaleKm,Kørsel,DiætTimepege)","v":0},{"$f":"SUM('4. Regnskab'!H45,'4. Regnskab'!H51,'4. Regnskab'!H57)","v":0},{"$f":"D12-E12","v":0},null,{"$f":"IF(OR(SUM('4. Regnskab'!H45,'4. Regnskab'!H51,'4. Regnskab'!H57)>SUM('3. Budget'!H38,'3. Budget'!H44,'3. Budget'!H50)*1.2,SUM('4. Regnskab'!H45,'4. Regnskab'!H51,'4. Regnskab'!H57)<SUM('3. Budget'!H38,'3. Budget'!H44,'3. Budget'!H50)*0.8),\"Vær opmærksom på, at afvigelse overstiger 20 %\",\"Ok\")","v":"Ok"}]
[]
[null,"IV. Øvrige udgifter",null,{"$f":"SUM(Maskinkraft,Skurvogn,'3. Budget'!H72)","v":0},{"$f":"SUM('4. Regnskab'!H64,'4. Regnskab'!H69,'4. Regnskab'!H79)","v":0},{"$f":"D14-E14","v":0},null,{"$f":"IF(OR(SUM('4. Regnskab'!H64,'4. Regnskab'!H69,'4. Regnskab'!H79)>SUM('3. Budget'!H57,'3. Budget'!H62,'3. Budget'!H72)*1.2,SUM('4. Regnskab'!H64,'4. Regnskab'!H69,'4. Regnskab'!H79)<SUM('3. Budget'!H57,'3. Budget'!H62,'3. Budget'!H72)*0.8),\"Vær opmærksom på, at afvigelse overstiger 20 %\",\"Ok\")","v":"Ok"}]
[]
[null,"V. Uforudsete udgifter",null,{"$f":"Diverse","v":0},{"$f":"'4. Regnskab'!H84","v":0},{"$f":"D16-E16","v":0},null,{"$f":"IF('4. Regnskab'!H84>0,\"Er der godkendt forbrug af denne budgetpost?\",\"Ok\")","v":"Ok"}]
[]
[null,"VI. Udgifter til vinterforanstaltninger",null,{"$f":"'3. Budget'!H96","v":0},{"$f":"'4. Regnskab'!H94","v":0},{"$f":"D18-E18","v":0},null,{"$f":"IF('4. Regnskab'!H94>0,\"Er der godkendt forbrug af denne budgetpost?\",\"Ok\")","v":"Ok"}]
[]
[null,"VII. Værdi af faciliteter stillet til rådighed af bygherre",null,0,{"$f":"'4. Regnskab'!H109","v":0},{"$f":"D20-E20","v":0},null,{"$f":"IF('4. Regnskab'!H109>SUM('3. Budget'!H57,'3. Budget'!H62,'3. Budget'!H72)-SUM('4. Regnskab'!H64,'4. Regnskab'!H69,'4. Regnskab'!H79),\"Beløb overstiger budgetpost IV. Øvrige udgifter\",\"Ok\")","v":"Ok"}]
[]
[null,"Sum ekskl. vinter, inkl. moms",null,{"$f":"'3. Budget'!H84","v":0},{"$f":"'4. Regnskab'!H100-('4. Regnskab'!H94*1.25)","v":0},{"$f":"D22-E22","v":0},null,{"$f":"IF(OR('4. Regnskab'!H111>'3. Budget'!H84,'4. Regnskab'!H111<'3. Budget'!H84*0.8),\"Afvigelse, udfyld skema!\",\"Ok\")","v":"Ok"}]
[]
[null,"Afvigelsesforklaring:",null,null,null,null,null,{"$f":"IF('4. Regnskab'!H10=\"Ja\",\"NB! Husk at vedhæfte dokumentation for aftale om endelig afregning med efterfølgende beretningsskrivning.\",\"\")","v":""}]

{"sheet":"6.Statusrapport","index":5,"n_rows":77,"n_cols":5,"rows_kept":77,"cut":false,"hidden":false,"merged":[[3,3,4,8]]}
[null,null,null,{"$f":"IF(D13=\"Museet har akut behov for styrelsens stillingtagen (Svar ønskes inden for 7 hverdage)\",\"HASTER!\",\"\")","v":""}]
["STATUSRAPPORT, STØRRE ARKÆOLOGISK FORUNDERSØGELSE"]
[{"$f":"'2. Stamoplysninger'!E7","v":0}]
[{"$f":"'2. Stamoplysninger'!E13","v":"Vælg"}]
["Museet j. nr. ",null,{"$f":"'2. Stamoplysninger'!E12","v":0}]
["Sted- lok. nr.",null,{"$f":"'2. Stamoplysninger'!E8","v":0}]
["SLKS j. nr.",null,{"$f":"'2. Stamoplysninger'!E15","v":0}]
["System nr.",null,{"$f":"'2. Stamoplysninger'!E5","v":0}]
[null,null," "]
["Bygherre:",null,{"$f":"IF('2. Stamoplysninger'!E29>0,'2. Stamoplysninger'!E29,'2. Stamoplysninger'!E31)","v":0},"Årsag til fremsendelse (udfyld her)"]
[null,null,{"$f":"'2. Stamoplysninger'!E33","v":0},"Vælg","˅"]
[null,null,{"$f":"'2. Stamoplysninger'!E34","v":0}]
["Godkendt budget inkl. moms",null,null,"Vælg","˅"]
[null,null,{"$f":"'3. Budget'!H84","v":0}]
[]
[null,"Begrundelse ved hasteanmodning"]
[]
[]
[]
[]
[]
[null,"Fremdrift og frigivelser"]
[null,null,{"$f":"IF(#REF!=\"Museet har akut behov for styrelsens stillingtagen i denne sag (inden for 7 hverdag)\",\"HASTER!\",\"\")","v":{"$error":"#REF!"}}]
[]
[]
[]
[]
[]
[]
[]
[]
[]
[]
[]
[]
[]
[]
[null,"Undersøgelsens foreløbige resultater og videre prioritering"]
[]
[]
[]
[]
[]
[]
[]
[]
[null,"NB! Kortbilag skal vedhæftes ved fremsendelse af mail."]
[]
[]
[]
[]
[]
[]
[]
[]
[]
[]
[]
[]
[]
{"$rows_left_out":18}
{"sheet":"7. Delbudget (bilag)","index":6,"n_rows":79,"n_cols":9,"rows_kept":79,"cut":false,"hidden":false,"merged":[]}
["BILAG TIL UNDERSØGELSE - DELBUDGET",null,null,null,null,null,null,1]
[{"$f":"'2. Stamoplysninger'!E7","v":0}]
[]
[{"$f":"'2. Stamoplysninger'!E13","v":"Vælg"}]
["Museets j.nr.",null,{"$f":"'2. Stamoplysninger'!E12","v":0}]
["Sted- lok. nr.",null,{"$f":"'2. Stamoplysninger'!E8","v":0}]
["SLKS j. nr.",null,{"$f":"'2. Stamoplysninger'!E15","v":0},null,null,"Delbudget vedrører",null,0,"m²"]
[]
["I.  Feltarbejde",null,null,null,"(udfyld her)","(udfyld her)"]
[null,"1.","Felttimer",null,"Antal","á kr."]
[null,null,"Ansvarlig udgravningsleder",null,0,0,"=",{"$f":"E11*F11","v":0},"kr."]
[null,null,"Daglig udgravningsleder",null,0,0,"=",{"$f":"E12*F12","v":0},"kr."]
[null,null,"Akademisk medarbejder",null,0,0,"=",0,"kr."]
[null,null,"Studentermedhjælp",null,0,0,"=",0,"kr."]
[null,null,"Museumstekniker",null,0,0,"=",0,"kr."]
[null,null,"Arbejdsmand",null,0,0,"=",0,"kr."]
[null,null,"Felttimesum i alt",null,null,null,null,{"$f":"SUM(H11:H16)","v":0},"kr."]
[]
[null,"2.","Eksterne specialister",null,"Antal","á kr."]
[null,null,"Specialister",null,0,0,"=",{"$f":"E20*F20","v":0},"kr."]
[null,null,"Landmåler",null,0,0,"=",{"$f":"E21*F21","v":0},"kr."]
[null,null,"Øvrigt feltarbejde i alt",null,null,null,null,{"$f":"SUM(H20:H21)","v":0},"kr."]
[]
["II. Dokumentation og tilgængeliggørelse"]
[null,"1.","Arkæologisk beretning og kulturhistorisk rapport mv. anføres på hovedbudget."]
[]
[null,"2.","Konservering og naturvidenskab",null,null,"á kr."]
[null,null,"Se budgetredegørelse…",null,null,0,"=",{"$f":"F28","v":0},"kr."]
[null,null,"…",null,null,0,"=",{"$f":"F29","v":0},"kr."]
[null,null,"…",null,null,0,"=",0,"kr."]
[null,null,"…",null,null,0,"=",0,"kr."]
[null,null,"Konservering og naturvidenskab i alt",null,null,null,null,{"$f":"SUM(H28:H31)","v":0},"kr."]
[]
["III.  Personale- og transportudgifter"]
[null,"1.","Transport",null,"Km","á kr."]
[null,null,"Kørselsgodtgørelse",null,0,0,"=",{"$f":"E36*F36","v":0},"kr."]
[null,null,"Rejsegodtgørelse",null,0,0,"=",{"$f":"E37*F37","v":0},"kr."]
[null,null,"Transport i alt",null,null,null,null,{"$f":"SUM(H36:H37)","v":0},"kr."]
[]
[null,"2.","Kørsel",null,"Km","á kr."]
[null,null,"Kørsel i museets/privatbil",null,0,0,"=",{"$f":"E41*F41","v":0},"kr."]
[null,null,"Lejet bil",null,0,0,"=",{"$f":"E42*F42","v":0},"kr."]
[null,null,"Transport til arbejdsplads (arbejdstid)",null,0,0,"=",0,"kr."]
[null,null,"Kørsel i alt",null,null,null,null,{"$f":"SUM(H41:H43)","v":0},"kr."]
[]
[null,"3.","Diæter samt timepenge",null,"Antal dage","á kr."]
[null,null,"Dagdiæter",null,0,0,"=",{"$f":"E47*F47","v":0},"kr."]
[null,null,"Natdiæter",null,0,0,"=",{"$f":"E48*F48","v":0},"kr."]
[null,null,"Timepenge / felttillæg",null,0,0,"=",0,"kr."]
[null,null,"Diæter samt timepenge i alt",null,null,null,null,{"$f":"SUM(H47:H49)","v":0},"kr."]
[]
["IV. Øvrige udgifter"]
[null,"1.","Maskinkraft",null,"Antal timer","á kr."]
[null,null,"Afrømning",null,0,0,"=",{"$f":"E54*F54","v":0},"kr."]
[null,null,"Tildækning",null,0,0,"=",{"$f":"E55*F55","v":0},"kr."]
[null,null,"Transport",null,0,0,"=",0,"kr."]
[null,null,"Maskinkraft ialt",null,null,null,null,{"$f":"SUM(H54:H56)","v":0},"kr."]
[]
[null,"2.","Skurvogn o. lign.",null,"Antal","á kr."]
[null,null,"Leje pr. dag",null,0,0,"=",{"$f":"E60*F60","v":0},"kr."]
{"$rows_left_out":20}
{"sheet":"Data","index":7,"n_rows":100,"n_cols":7,"rows_kept":100,"cut":false,"hidden":true,"merged":[]}
["Bygherretype","Anlægsarbejdets karakter","Landskab","Kulturarvsareal","Årsag til fremsendelse af statusskema","Ønske om dialog","Kommune"]
["Vælg","Vælg","Vælg","Vælg","Vælg","Vælg","Vælg"]
["Privat virksomhed f.eks. A/S, ApS, I/S, landbrug (med CVR nr.)","Andet, se faglig argumentation","Åbent land","Nej","Væsenligt ændret arkæologisk potentiale","Undersøgelsen forløber som planlagt (Se beskrivelse nedenfor)","Albertslund Kommune"]
["Privat person (uden CVR nr.)","Anlægsarbejde, andet","Bebygget areal","Regional betydning","Aktivering af vinterforanstaltninger","Museet anmoder om styrelsens vurdering (Svar ønskes)","Allerød Kommune"]
["Offentlig, Stat","Anlægsarbejde, byggeri","Middelalderbykerne","National betydning","50 % fremdrift af feltarbejde (Budget på mellem  500.000 og 3.000.000 kr. inkl. moms)","Museet har akut behov for styrelsens stillingtagen (Svar ønskes inden for 7 hverdage)","Assens Kommune"]
["Offentlig, Region","Anlægsarbejde, byggemodning","Mose, vådområder el. lign","International betydning","25 % fremdrift af feltarbejde (Budget på mellem 3.000.000 og 10.000.000 kr. inkl. moms)",null,"Ballerup Kommune"]
["Offentlig, Kommune","Anlægsarbejde, vej","Skov","Tidligere udpeget in situ areal","50 % fremdrift af feltarbejde (Budget på mellem 3.000.000 og 10.000.000 kr. inkl. moms)",null,"Billund Kommune"]
["Offentlig, Kommunal virksomhed","Anlægsarbejde, tracé","Andet, se faglig argumentation",null,"75 % fremdrift af feltarbejde (Budget på mellem 3.000.000 og 10.000.000 kr. inkl. moms)",null,"Bornholms Regionskommune"]
["Museet er selv bygherre","Dyrkning",null,null,"Sag med budgetbeløb på over 10.000.000 inkl. moms, afrapportering efter særaftale",null,"Brøndby Kommune"]
[null,"Erosion",null,null,"Årlig statusrapport",null,"Brønderslev Kommune"]
[null,"Læhegn",null,null,"Anmodning om anvisning af tilskud eller bevilling",null,"Dragør Kommune"]
[null,"Naturgenopretning",null,null,null,null,"Egedal Kommune"]
[null,"Råstofindvinding",null,null,null,null,"Esbjerg Kommune"]
[null,"Salg af jord",null,null,null,null,"Fanø Kommune"]
[null,"Skovrejsning",null,null,null,null,"Favrskov Kommune"]
[null,"Skovrejsning, med tilskud",null,null,null,null,"Faxe Kommune"]
[null,null,null,null,null,null,"Fredensborg Kommune"]
[null,null,null,null,null,null,"Fredericia Kommune"]
[null,null,null,null,null,null,"Frederiksberg Kommune"]
[null,null,null,null,null,null,"Frederikshavn Kommune"]
[null,null,null,null,null,null,"Frederikssund Kommune"]
[null,null,null,null,null,null,"Furesø Kommune"]
[null,null,null,null,null,null,"Faaborg-Midtfyn Kommune"]
[null,null,null,null,null,null,"Gentofte Kommune"]
[null,null,null,null,null,null,"Gladsaxe Kommune"]
[null,null,null,null,null,null,"Glostrup Kommune"]
[null,null,null,null,null,null,"Greve Kommune"]
[null,null,null,null,null,null,"Gribskov Kommune"]
[null,null,null,null,null,null,"Guldborgsund Kommune"]
[null,null,null,null,null,null,"Haderslev Kommune"]
[null,null,null,null,null,null,"Halsnæs Kommune"]
[null,null,null,null,null,null,"Hedensted Kommune"]
[null,null,null,null,null,null,"Helsingør Kommune"]
[null,null,null,null,null,null,"Herlev Kommune"]
[null,null,null,null,null,null,"Herning Kommune"]
[null,null,null,null,null,null,"Hillerød Kommune"]
[null,null,null,null,null,null,"Hjørring Kommune"]
[null,null,null,null,null,null,"Holbæk Kommune"]
[null,null,null,null,null,null,"Holstebro Kommune"]
[null,null,null,null,null,null,"Horsens Kommune"]
[null,null,null,null,null,null,"Hvidovre Kommune"]
[null,null,null,null,null,null,"Høje-Taastrup Kommune"]
[null,null,null,null,null,null,"Hørsholm Kommune"]
[null,null,null,null,null,null,"Ikast-Brande Kommune"]
[null,null,null,null,null,null,"Ishøj Kommune"]
[null,null,null,null,null,null,"Jammerbugt Kommune"]
[null,null,null,null,null,null,"Kalundborg Kommune"]
[null,null,null,null,null,null,"Kerteminde Kommune"]
[null,null,null,null,null,null,"Kolding Kommune"]
[null,null,null,null,null,null,"Københavns Kommune"]
[null,null,null,null,null,null,"Køge Kommune"]
[null,null,null,null,null,null,"Langeland Kommune"]
[null,null,null,null,null,null,"Lejre Kommune"]
[null,null,null,null,null,null,"Lemvig Kommune"]
[null,null,null,null,null,null,"Lolland Kommune"]
[null,null,null,null,null,null,"Lyngby-Taarbæk Kommune"]
[null,null,null,null,null,null,"Læsø Kommune"]
[null,null,null,null,null,null,"Mariagerfjord Kommune"]
[null,null,null,null,null,null,"Middelfart Kommune"]
[null,null,null,null,null,null,"Morsø Kommune"]
{"$rows_left_out":41}
{"sheet":"Logo","index":8,"n_rows":34,"n_cols":4,"rows_kept":34,"cut":false,"hidden":true,"merged":[]}
["MuseumsLogo","Museum","Logo_ref","Lopslag"]
[null,"Vælg","Logo!a2"]
[null,"ARKVEST, Arkæologi Vestjylland","Logo!a3",{"$f":"VLOOKUP('2. Stamoplysninger'!$E$13,Logo!B2:C34,2,FALSE)","v":"Logo!a2"}]
[null,"Arkæologi Sydfyn, Langelands Museum","Logo!a4"]
[null,"Arkæologi Sydfyn, Svendborg Museum","Logo!a5"]
[null,"Arkæologi Sydfyn, Øhavsmuseet Faaborg","Logo!a6"]
[null,"Arkæologi Sydfyn, Østfyns Museer","Logo!a7"]
[null,"Bornholms Museum","Logo!a8"]
[null,"De Kulturhistoriske Museer i Holstebro","Logo!a9"]
[null,"Horsens Museum","Logo!a10"]
[null,"Kroppedal Museum","Logo!a11"]
[null,"Københavns Museum","Logo!a12"]
[null,"MOMU, Moesgaard Museum","Logo!a13"]
[null,"Museet Sønderskov","Logo!a14"]
[null,"Museum Lolland Falster","Logo!a15"]
[null,"Museum Midtjylland","Logo!a16"]
[null,"Museum Nordsjælland","Logo!a17"]
[null,"Museum Salling","Logo!a18"]
[null,"Museum Silkeborg","Logo!a19"]
[null,"Museum Skanderborg","Logo!a20"]
[null,"Museum Sydøstdanmark","Logo!a21"]
[null,"Museum Sønderjylland","Logo!a22"]
[null,"Museum Thy","Logo!a23"]
[null,"Museum Vestsjælland","Logo!a24"]
[null,"Museum Østjylland","Logo!a25"]
[null,"Nordjyske Museer","Logo!a26"]
[null,"Museum Odense","Logo!a27"]
[null,"ROMU, Roskilde Museum","Logo!a28"]
[null,"Sydvestjyske Museer","Logo!a29"]
[null,"Vejle Museerne","Logo!a30"]
[null,"Vendsyssel Historiske Museum","Logo!a31"]
[null,"Vesthimmerlands Museum","Logo!a32"]
[null,"Viborg Museum","Logo!a33"]
[null,"-","Logo!a34"]