{"text_format":"1","workbook":"xlsx","n_sheets":9,"sheets":["1. Vejledning","2. Stamoplysninger","3. Budget","4. Regnskab","5. Redegørelse","6. Statusrapport","7.Delbudget (bilag)","Data","Logoer"],"not_rendered":{"charts":0,"images":35,"macros":1,"external_links":0,"defined_names":53,"comments":2,"pivot_tables":0},"unopened":[],"bounds":{"document_bytes":16777216,"sheet_cells":100000,"rows_first":2000,"rows_last":500,"rows_between":2000,"halvings":0,"cell_chars":16384,"cell_head_chars":4096},"cells_cut":0,"cells_raw":0,"read":"whole","date_system":"1900"}

{"sheet":"1. Vejledning","index":0,"n_rows":25,"n_cols":4,"rows_kept":25,"cut":false,"hidden":false,"merged":[]}
[]
["KORT VEJLEDNING I BRUG AF SKEMAET"]
[]
[null,"Introduktion"]
[]
[null,"2. Stamoplysninger"]
[]
[null,"3. Budget"]
[]
[null,"4. Regnskab"]
[]
[null,"5. Redegørelse"]
[]
[null,"6. Statusrapport"]
[]
[null,"7. Delbudget (bilag)"]
[]
[]
[]
[]
[]
[]
[]
[]
[null,null,null,"Version 1.04 gældende fra 07-06-2023"]

{"sheet":"2. Stamoplysninger","index":1,"n_rows":62,"n_cols":6,"rows_kept":62,"cut":false,"hidden":false,"merged":[]}
[null,null,null,null,null," "]
[null,"STAMOPLYSNINGER, FORUNDERSØGELSE I FORM AF OVERVÅGNING"]
[]
[null,null,"Stedoplysninger",null,"(udfyld her)"]
[null,null,null,"Systemnr. fra Fund og Fortidsminder"," "]
[]
[null,null,null,"Lokalitetsnavn"," "]
[null,null,null,"Sted- og lok. nr."," "]
[null,null,null,"Matrikler"]
[null,null,null,"Ejerlav"]
[null,null,null,"Kommune","Vælg","˅"]
[null,null,null,"Museets journalnummer"," "]
[null,null,null,"Museum","Vælg","˅"]
[]
[null,null,null,"Styrelsens j. nr. oplyses ved afgørelsen"," "]
[]
[null,null,"Til beregning af udgifter"]
[null,null,null,"Måleenheder","Kubikmeter (m³) ","˅"]
[]
[null,null,null,{"$f":"IF(F24=\"m³\",\"Varighed af overvågning (typisk bylag)\",\"Varighed af overvågning (åbent land)\")","v":"Varighed af overvågning (typisk bylag)"},0,"timer"]
[null,null,null,"Arbejdsdagens gennemsnitlige varighed",7.4,"timer"]
[null,null,null,"Antal feltdage",{"$f":"ROUNDUP(E20/E21,0)","v":0},"dage"]
[]
[null,null,null,{"$f":"IF(F24=\"m³\",\"Lag som skal overvåges (typisk bylag)\",\"Flade som skal overvåges (åbent land)\")","v":"Lag som skal overvåges (typisk bylag)"},0,{"$f":"IF(E18=\"Kubikmeter (m³) \",\"m³\",\"m²\")","v":"m³"}]
[null,null,null,"Ekstra bemanding pr. dag",1]
[]
[null,null,"Landskab"]
[null,null,null,"Kulturarvsareal","Vælg","˅"]
[null,null,null,"Topografi","Vælg","˅"]
[]
[null,null,"Identifikation af bygherre"]
[null,null,null,"Bygherretype","Vælg","˅"]
[]
[null,null,null,"CVR-nummer"," "]
[null,null,null,"P-nummer"]
[null,null,null,"Navn virksomhed/person"," "]
[]
[null,null,null,"Vejnavn og nr."," "]
[null,null,null,"Postnummer og by"," "]
[null,null,null,"Land"," "]
[null,null,null,"Telefon"]
[null,null,null,"e-mail"]
[]
[null,null,"Bygherres kontaktperson"]
[null,null,null,"CVR-nummer"]
[null,null,null,"P-nummer"]
[null,null,null,"Navn virksomhed/person"," "]
[]
[null,null,null,"Vejnavn og nr."," "]
[null,null,null,"Postnummer og by"," "]
[null,null,null,"Land"," "]
[null,null,null,"Telefon"]
[null,null,null,"e-mail"]
[]
[]
[null,null,"Øvrige oplysninger"]
[null,null,null,"Årsag","Vælg","˅"]
[null,null,null,"Bygherres samlede projektareal",null,"m²"]
[null,null,null,"Bygherres samlede økonomiske ramme",null,"kr. inkl. moms"]
[]
{"$rows_left_out":3}
{"sheet":"3. Budget","index":2,"n_rows":95,"n_cols":9,"rows_kept":95,"cut":false,"hidden":false,"merged":[]}
["BUDGET FOR STØRRE ARKÆOLOGISK FORUNDERSØGELSE"]
["I FORM AF OVERVÅGNING AF JORDARBEJDE"]
[{"$f":"'2. Stamoplysninger'!E7","v":" "}]
[{"$f":"'2. Stamoplysninger'!E13","v":"Vælg"}]
["Museet j. nr. ",null,{"$f":"'2. Stamoplysninger'!E12","v":" "}]
["Sted- lok. nr.",null,{"$f":"'2. Stamoplysninger'!E8","v":" "}]
["SLKS j. nr.",null,{"$f":"'2. Stamoplysninger'!E15","v":" "}]
[null,null," "]
["Bygherre:",null,{"$f":"'2. Stamoplysninger'!E34","v":" "}]
[null,null,{"$f":"'2. Stamoplysninger'!E36","v":" "}]
[null,null,{"$f":"'2. Stamoplysninger'!E38","v":" "}]
[null,null,{"$f":"'2. Stamoplysninger'!E39","v":" "}]
[]
["I.  Feltarbejde",null,null,null,"(udfyld her)","(udfyld her)"]
[null,"1.","Felttimer",null,"Antal","á kr."]
[null,null,"Ansvarlig udgravningsleder",null,{"$f":"IF(OR(SUM(E17:E21)>110,E17=0),SUM(E17:E21)*0.05,5)","v":0},530,"=",{"$f":"E16*F16","v":0},"kr."]
[null,null,"Daglig udgravningsleder",null,{"$f":"'2. Stamoplysninger'!E20","v":0},475,"=",0,"kr."]
[null,null,"Akademisk medarbejder",null,{"$f":"'2. Stamoplysninger'!E20*'2. Stamoplysninger'!E25","v":0},465,"=",0,"kr."]
[null,null,"Studentermedhjælper",null,0,395,"=",0,"kr."]
[null,null,"Museumstekniker",null,0,400,"=",0,"kr."]
[null,null,"Arbejdsperson",null,0,360,"=",0,"kr."]
[null,null,"Felttimesum i alt",null,null,null,null,{"$f":"SUM(H16:H21)","v":0},"kr."]
[]
[null,"2.","Eksterne specialister",null,"Antal","á kr."]
[null,null,"Specialist",null,0,0,"=",{"$f":"E25*F25","v":0},"kr."]
[null,null,"Landmåler",null,0,0,"=",{"$f":"E26*F26","v":0},"kr."]
[null,null,"Øvrigt feltarbejde i alt",null,null,null,null,{"$f":"SUM(H25:H26)","v":0},"kr."]
[]
["II. Dokumentation og tilgængeliggørelse"]
[null,"1.","Arkæologisk beretning og kulturhistorisk"]
[null,null," rapport samt indføring og magasinering"]
[null,null,null,null,null,0.2,"=",{"$f":"IF(OR(Felttimesum>F17*25,Felttimesum=0),H22*F32,F17*5)","v":0},"kr."]
[null,null,"Dokumentation i alt",null,null,null,null,{"$f":"SUM(H32)","v":0},"kr."]
[]
["III.  Personale- og transportudgifter"]
[null,"1.","Transport",null,"Km","á kr."]
[null,null,"Kørselsgodtgørelse",null,0,0,"=",{"$f":"E37*F37","v":0},"kr."]
[null,null,"Rejsegodtgørelse",null,0,0,"=",{"$f":"E38*F38","v":0},"kr."]
[null,null,"Transport i alt",null,null,null,null,{"$f":"SUM(H37:H38)","v":0},"kr."]
[]
[null,"2.","Kørsel",null,"Km pr. dag","á kr."]
[null,null,"Kørsel i museets/privatbil",null,0,3.73,"=",{"$f":"'2. Stamoplysninger'!E22*E42*F42","v":0},"kr."]
[null,null,"Lejet bil",null,0,0,"=",{"$f":"E43*F43","v":0},"kr."]
[null,null,"Transport til arbejdsplads (arbejdstid)",null,0,0,"=",{"$f":"E44*F44","v":0},"kr."]
[null,null,"Kørsel i alt",null,null,null,null,{"$f":"SUM(H42:H44)","v":0},"kr."]
[]
[null,"3.","Diæter og timepenge",null,"Antal dage","á kr."]
[null,null,"Dagdiæter",null,0,0,"=",{"$f":"E48*F48","v":0},"kr."]
[null,null,"Natdiæter",null,0,0,"=",{"$f":"E49*F49","v":0},"kr."]
[null,null,"Timepenge/felttillæg",null,{"$f":"ROUNDUP(SUM(E17:E21)/7.4,0)","v":0},0,"=",{"$f":"E50*F50","v":0},"kr."]
[null,null,"Diæter og timepenge i alt",null,null,null,null,{"$f":"SUM(H48:H50)","v":0},"kr."]
[]
["IV. Øvrige udgifter"]
[null,"1.","Skurvogn og lign.",null,"Antal","á kr."]
[null,null,"Leje inkl. Drift",null,{"$f":"'2. Stamoplysninger'!E22","v":0},670,"=",{"$f":"E55*F55","v":0},"kr."]
[null,null,"Transport",null,{"$f":"IF(E55>0,2,0)","v":0},500,"=",{"$f":"E56*F56","v":0},"kr."]
[null,null,"Skurvogn inkl. transport i alt ",null,null,null,null,{"$f":"SUM(H55:H56)","v":0},"kr."]
[]
[null,"2.","Materialer og særligt udstyr",null,"Antal","á kr."]
[null,null,"Opmålingsudstyr",null,{"$f":"'2. Stamoplysninger'!E22","v":0},420,"=",{"$f":"E60*F60","v":0},"kr."]
{"$rows_left_out":36}
{"sheet":"4. Regnskab","index":3,"n_rows":144,"n_cols":9,"rows_kept":144,"cut":false,"hidden":false,"merged":[]}
["REGNSKAB FOR STØRRE ARKÆOLOGISK FORUNDERSØGELSE"]
["I FORM AF OVERVÅGNING AF JORDARBEJDE"]
[{"$f":"'2. Stamoplysninger'!E7","v":" "}]
[{"$f":"'2. Stamoplysninger'!E13","v":"Vælg"}]
["Museet j. nr. ",null,{"$f":"'2. Stamoplysninger'!E12","v":" "}]
["Sted- lok. nr.",null,{"$f":"'2. Stamoplysninger'!E8","v":" "}]
["SLKS j. nr.",null,{"$f":"'2. Stamoplysninger'!E15","v":" "}]
[]
["Bygherre:",null,{"$f":"'2. Stamoplysninger'!E34","v":" "}]
[null,null,{"$f":"'2. Stamoplysninger'!E36","v":" "},null,null,"Endeligt areal",null,0,{"$f":"'2. Stamoplysninger'!F24","v":"m³"}]
[null,null,{"$f":"'2. Stamoplysninger'!E38","v":" "},null,null,"Efterfølgende beretning",null,"Nej","˅"]
[null,null,{"$f":"'2. Stamoplysninger'!E39","v":" "}]
[]
["Bemærkning:"]
[null,null,null,null,"NB! Regnskabsaflæggelse ift. styrelsen, ikke faktura"]
["I.  Feltarbejde",null,null,null,"(udfyld her)","(udfyld her)"]
[null,"1.","Felttimer",null,"Antal","á kr."]
[null,null,{"$f":"'3. Budget'!C16","v":"Ansvarlig udgravningsleder"},null,0,0,"=",{"$f":"E18*F18","v":0},"kr."]
[null,null,{"$f":"'3. Budget'!C17","v":"Daglig udgravningsleder"},null,0,0,"=",0,"kr."]
[null,null,{"$f":"'3. Budget'!C18","v":"Akademisk medarbejder"},null,0,0,"=",0,"kr."]
[null,null,{"$f":"'3. Budget'!C19","v":"Studentermedhjælper"},null,0,0,"=",0,"kr."]
[null,null,{"$f":"'3. Budget'!C20","v":"Museumstekniker"},null,0,0,"=",0,"kr."]
[null,null,{"$f":"'3. Budget'!C21","v":"Arbejdsperson"},null,0,0,"=",0,"kr."]
[null,null,"…",null,0,0,"=",0,"kr."]
[null,null,"…",null,0,0,"=",0,"kr."]
[null,null,"…",null,0,0,"=",0,"kr."]
[null,null,"…",null,0,0,"=",0,"kr."]
[null,null,"Felttimesum i alt",null,null,null,null,{"$f":"SUM(H18:H27)","v":0},"kr."]
[]
[null,"2.","Eksterne specialister",null,"Antal","á kr."]
[null,null,"Specialist",null,0,0,"=",{"$f":"E31*F31","v":0},"kr."]
[null,null,"Landmåler",null,0,0,"=",{"$f":"E32*F32","v":0},"kr."]
[null,null,"Øvrigt feltarbejde i alt",null,null,null,null,{"$f":"SUM(H31:H32)","v":0},"kr."]
[]
["II. Dokumentation og tilgængeliggørelse"]
[null,"1.","Arkæologisk beretning og kulturhistorisk"]
[null,null," rapport samt indføring og magasinering",null,"Timer"]
[null,null,null,null,null,null,"=",{"$f":"IF(AND(H11=\"Ja\",H28<Felttimesum),H28*'3. Budget'!F32,IF(AND(H11=\"Ja\",H28>Felttimesum),Rapport,0))","v":0},"kr."]
[null,null,"Dokumentation i alt",null,null,null,null,{"$f":"SUM(H38)","v":0},"kr."]
[]
["III.  Personale- og transportudgifter"]
[null,"1.","Transport",null,"Km","á kr."]
[null,null,"Kørselsgodtgørelse",null,0,0,"=",{"$f":"E43*F43","v":0},"kr."]
[null,null,"Rejsegodtgørelse",null,0,0,"=",{"$f":"E44*F44","v":0},"kr."]
[null,null,"Transport i alt",null,null,null,null,{"$f":"SUM(H43:H44)","v":0},"kr."]
[]
[null,"2.","Kørsel",null,"Km pr. dag","á kr."]
[null,null,"Kørsel i museets/privatbil",null,0,0,"=",{"$f":"E48*F48","v":0},"kr."]
[null,null,"Lejet bil",null,0,0,"=",{"$f":"E49*F49","v":0},"kr."]
[null,null,"Transport til arbejdsplads (arbejdstid)",null,0,0,"=",{"$f":"E50*F50","v":0},"kr."]
[null,null,"Kørsel i alt",null,null,null,null,{"$f":"SUM(H48:H50)","v":0},"kr."]
[]
[null,"3.","Diæter og timepenge",null,"Antal dage","á kr."]
[null,null,"Dagdiæter",null,0,0,"=",{"$f":"E54*F54","v":0},"kr."]
[null,null,"Natdiæter",null,0,0,"=",{"$f":"E55*F55","v":0},"kr."]
[null,null,"Timepenge/felttillæg",null,0,0,"=",{"$f":"E56*F56","v":0},"kr."]
[null,null,"Diæter og timepenge i alt",null,null,null,null,{"$f":"SUM(H54:H56)","v":0},"kr."]
[]
["IV. Øvrige udgifter"]
[null,"1.","Skurvogn og lign.",null,"Antal","á kr."]
{"$rows_left_out":85}
{"sheet":"5. Redegørelse","index":4,"n_rows":22,"n_cols":8,"rows_kept":22,"cut":false,"hidden":false,"merged":[]}
[]
[null,"REGNSKABSREDEGØRELSE"]
[null,null,null,"Budget","Regnskab","Diskrepans"]
[null,"Areal m²/m³:",null,{"$f":"'2. Stamoplysninger'!E24","v":0},{"$f":"'4. Regnskab'!H10","v":0},{"$f":"D4-E4","v":0},null,{"$f":"IF(OR(E4>D4*1.1,E4<D4*0.9),\"Vær opmærksom på, at arealet afviger mere end 10 %\",\"Ok\")","v":"Ok"}]
[]
[null,"I.  Feltarbejde",null,{"$f":"SUM(Felttimesum,Specialister)","v":0},{"$f":"SUM('4. Regnskab'!H28,'4. Regnskab'!H33)","v":0},{"$f":"D6-E6","v":0},null,{"$f":"IF(OR(E6>D6*1.2,E6<D6*0.8),\"Vær opmærksom på, at  afvigelsen overstiger 20%\",\"Ok\")","v":"Ok"}]
[]
[null,"II. Dokumentation og tilgængeliggørelse",null,{"$f":"Rapport","v":0},{"$f":"'4. Regnskab'!H39","v":0},{"$f":"D8-E8","v":0},null,{"$f":"IF(OR('4. Regnskab'!H39>Rapport*1.2,'4. Regnskab'!H39<Rapport*0.8),\"Vær opmærksom på, at  afvigelsen overstiger 20%\",\"Ok\")","v":"Ok"}]
[]
[null,"III.  Personale- og transportudgifter",null,{"$f":"SUM(Transport_PersonaleKm,Kørsel,DiætTimepege)","v":0},{"$f":"SUM('4. Regnskab'!H45,'4. Regnskab'!H51,'4. Regnskab'!H57)","v":0},{"$f":"D10-E10","v":0},null,{"$f":"IF(OR(E10>D10*1.2,E10<D10*0.8),\"Vær opmærksom på, at  afvigelsen overstiger 20%\",\"Ok\")","v":"Ok"}]
[]
[null,"IV. Øvrige udgifter",null,{"$f":"SUM(Skurvogn,'3. Budget'!H65)","v":0},{"$f":"SUM('4. Regnskab'!H63,'4. Regnskab'!H71)","v":0},{"$f":"D12-E12","v":0},null,{"$f":"IF(OR(E12>D12,D12*1.2,E12<D12*0.8),\"Vær opmærksom på, at  afvigelsen overstiger 20%\",\"Ok\")","v":"Ok"}]
[]
[null,"V. Uforudsete udgifter",null,{"$f":"Diverse","v":0},{"$f":"'4. Regnskab'!H76","v":0},{"$f":"D14-E14","v":0},null,{"$f":"IF('4. Regnskab'!H76>0,\"Er der godkendt forbrug af denne budgetpost?\",\"Ok\")","v":"Ok"}]
[]
[null,"VI. Udgifter til vinterforanstaltninger",null,{"$f":"'3. Budget'!H89","v":0},{"$f":"'4. Regnskab'!H86","v":0},{"$f":"D16-E16","v":0},null,{"$f":"IF(E16>0,\"Er der godkendt forbrug af denne budgetpost?\",\"Ok\")","v":"Ok"}]
[]
[null,"VI. Værdi af faciliteter stillet til rådighed af bygherre",null,0,{"$f":"'4. Regnskab'!H101","v":0},{"$f":"D18-E18","v":0},null,{"$f":"IF(E18>D12-E12,\"Beløb overstiger budgetpost IV. Øvrige udgifter\",\"Ok\")","v":"Ok"}]
[]
[null,"Sum ekskl. vinter, inkl. moms",null,{"$f":"'3. Budget'!H77","v":0},{"$f":"'4. Regnskab'!H103-('4. Regnskab'!H86*1.25)","v":0},{"$f":"D20-E20","v":0},null,{"$f":"IF(OR('4. Regnskab'!H103>'3. Budget'!H94,'4. Regnskab'!H103<'3. Budget'!H94*0.8),\"Afvigelse, udfyld skema!\",\"Ok\")","v":"Ok"}]
[]
[null,"Afvigelsesforklaring:",null,null,null,null,null,{"$f":"IF('4. Regnskab'!H11=\"Ja\",\"NB! Husk at vedhæfte dokumentation for endelig afregning med efterfølgende beretningskrivning.\",\"\")","v":""}]

{"sheet":"6. Statusrapport","index":5,"n_rows":78,"n_cols":5,"rows_kept":78,"cut":false,"hidden":false,"merged":[[4,3,5,8]]}
[null,null,null,{"$f":"IF(D14=\"Museet har akut behov for styrelsens stillingtagen (Svar ønskes inden for 7 hverdage)\",\"HASTER!\",\"\")","v":""}]
["STATUSRAPPORT, STØRRE ARKÆOLOGISK FORUNDERSØGELSE"]
["I FORM AF OVERVÅGNING AF JORDARBEJDE"]
[{"$f":"'3. Budget'!A3","v":" "}]
[{"$f":"'2. Stamoplysninger'!E13","v":"Vælg"}]
["Museet j. nr. ",null,{"$f":"'2. Stamoplysninger'!E12","v":" "}]
["Sted- lok. nr.",null,{"$f":"'2. Stamoplysninger'!$E$8","v":" "}]
["SLKS j. nr.",null,{"$f":"'2. Stamoplysninger'!E15","v":" "}]
["System nr.",null,{"$f":"'2. Stamoplysninger'!E5","v":" "}]
[null,null," "]
["Bygherre:",null,{"$f":"IF('2. Stamoplysninger'!E34>0,'2. Stamoplysninger'!E34,'2. Stamoplysninger'!E36)","v":" "},"Årsag til fremsendelse (udfyld her)"]
[null,null,{"$f":"'2. Stamoplysninger'!E39","v":" "},"Vælg","˅"]
[null,null,{"$f":"'2. Stamoplysninger'!E40","v":" "}]
["Godkendt budget inkl. moms",null,null,"Vælg","˅"]
[null,null,{"$f":"'3. Budget'!H77","v":0}]
[]
[null,"Begrundelse ved hasteanmodning"]
[]
[]
[]
[]
[]
[null,"Fremdrift og frigivelser"]
[null,null,{"$f":"IF(#REF!=\"Museet har akut behov for styrelsens stillingtagen i denne sag (inden for 7 hverdag)\",\"HASTER!\",\"\")","v":{"$error":"#REF!"}}]
[]
[]
[]
[]
[]
[]
[]
[]
[]
[]
[]
[]
[]
[]
[null,"Undersøgelsens foreløbige resultater og videre prioritering"]
[]
[]
[]
[]
[]
[]
[]
[]
[null,"NB! Kortbilag skal vedhæftes ved fremsendelse af mail."]
[]
[]
[]
[]
[]
[]
[]
[]
[]
[]
[]
[]
{"$rows_left_out":19}
{"sheet":"7.Delbudget (bilag)","index":6,"n_rows":76,"n_cols":9,"rows_kept":76,"cut":false,"hidden":false,"merged":[]}
["BILAG TIL UNDERSØGELSE - DELBUDGET",null,null,null,null,null,null,1]
[{"$f":"'2. Stamoplysninger'!E7","v":" "}]
[]
[{"$f":"'2. Stamoplysninger'!E13","v":"Vælg"}]
["Museet j. nr. ",null,{"$f":"'2. Stamoplysninger'!E12","v":" "}]
["Sted- lok. nr.",null,{"$f":"'2. Stamoplysninger'!E8","v":" "}]
["SLKS j. nr.",null,{"$f":"'2. Stamoplysninger'!E15","v":" "}]
[null,null," "]
["Bygherre:",null,{"$f":"IF('2. Stamoplysninger'!E34>0,'2. Stamoplysninger'!E34,'2. Stamoplysninger'!E36)","v":" "}]
[null,null,{"$f":"'2. Stamoplysninger'!E38","v":" "}]
[null,null,{"$f":"'2. Stamoplysninger'!E39","v":" "},null,null,"Delbudget vedrører",null,0,"m²"]
[]
["I.  Feltarbejde",null,null,null,"(udfyld her)","(udfyld her)"]
[null,"1.","Felttimer",null,"Antal","á kr."]
[null,null,"Ansvarlig udgravningsleder",null,0,0,"=",{"$f":"E15*F15","v":0},"kr."]
[null,null,"Daglig udgravningsleder",null,0,0,"=",{"$f":"E16*F16","v":0},"kr."]
[null,null,"Akademisk medarbejder",null,0,0,"=",0,"kr."]
[null,null,"Studentermedhjælper",null,0,0,"=",0,"kr."]
[null,null,"Museumstekniker",null,0,0,"=",0,"kr."]
[null,null,"Arbejdsmand",null,0,0,"=",0,"kr."]
[null,null,"Felttimesum i alt",null,null,null,null,{"$f":"SUM(H15:H20)","v":0},"kr."]
[]
[null,"2.","Eksterne specialister",null,"Antal","á kr."]
[null,null,"Specialist",null,0,0,"=",{"$f":"E24*F24","v":0},"kr."]
[null,null,"Landmåler",null,0,0,"=",{"$f":"E25*F25","v":0},"kr."]
[null,null,"Øvrigt feltarbejde i alt",null,null,null,null,{"$f":"SUM(H24:H25)","v":0},"kr."]
[]
["II. Dokumentation og tilgængeliggørelse"]
[null,"1.","Arkæologisk beretning og kulturhistorisk rapport mv. anføres på hovedbudget."]
[]
["III.  Personale- og transportudgifter"]
[null,"1.","Transport",null,"Km","á kr."]
[null,null,"Kørselsgodtgørelse",null,0,0,"=",{"$f":"E33*F33","v":0},"kr."]
[null,null,"Rejsegodtgørelse",null,0,0,"=",{"$f":"E34*F34","v":0},"kr."]
[null,null,"Transport i alt",null,null,null,null,{"$f":"SUM(H33:H34)","v":0},"kr."]
[]
[null,"2.","Kørsel",null,"Km","á kr."]
[null,null,"Kørsel i museets/privatbil",null,0,0,"=",{"$f":"E38*F38","v":0},"kr."]
[null,null,"Lejet bil",null,0,0,"=",{"$f":"E39*F39","v":0},"kr."]
[null,null,"Transport til arbejdsplads (arbejdstid)",null,0,0,"=",0,"kr."]
[null,null,"Kørsel i alt",null,null,null,null,{"$f":"SUM(H38:H40)","v":0},"kr."]
[]
[null,"3.","Diæter og timepenge",null,"Antal dage","á kr."]
[null,null,"Dagdiæter",null,0,0,"=",{"$f":"E44*F44","v":0},"kr."]
[null,null,"Natdiæter",null,0,0,"=",{"$f":"E45*F45","v":0},"kr."]
[null,null,"Timepenge/felttillæg",null,0,0,"=",0,"kr."]
[null,null,"Diæter og timepenge i alt",null,null,null,null,{"$f":"SUM(H44:H46)","v":0},"kr."]
[]
["IV. Øvrige udgifter"]
[null,"1.","Maskinkraft",null,"Antal timer","á kr."]
[null,null,"Afrømning",null,0,0,"=",{"$f":"E51*F51","v":0},"kr."]
[null,null,"Tildækning",null,0,0,"=",{"$f":"E52*F52","v":0},"kr."]
[null,null,"Transport",null,0,0,"=",0,"kr."]
[null,null,"Maskinkraft i alt",null,null,null,null,{"$f":"SUM(H51:H53)","v":0},"kr."]
[]
[null,"2.","Skurvogn og lign.",null,"Antal","á kr."]
[null,null,"Leje pr. dag",null,0,0,"=",{"$f":"E57*F57","v":0},"kr."]
[null,null,"Transport",null,0,0,"=",{"$f":"E58*F58","v":0},"kr."]
[null,null,"Skurvogn inkl. transport i alt ",null,null,null,null,{"$f":"SUM(H57:H58)","v":0},"kr."]
[]
{"$rows_left_out":17}
{"sheet":"Data","index":7,"n_rows":100,"n_cols":7,"rows_kept":100,"cut":false,"hidden":true,"merged":[]}
["Bygherretype","Anlægsarbejdets karakter","Landskab","Kulturarvsareal","Årsag til fremsendelse af statusskema","Ønske om dialog","Kommune"]
["Vælg","Vælg","Vælg","Vælg","Vælg","Vælg","Vælg"]
["Privat virksomhed f.eks. A/S, ApS, I/S, landbrug (med CVR nr.)","Andet, se faglig argumentation","Åbent land","Nej","Væsenligt ændret arkæologisk potentiale","Undersøgelsen forløber som planlagt (Se beskrivelse nedenfor)","Albertslund Kommune"]
["Privat person (uden CVR nr.)","Anlægsarbejde, andet","Bebygget areal","Regional betydning","Aktivering af vinterforanstaltninger","Museet anmoder om styrelsens vurdering (Svar ønskes)","Allerød Kommune"]
["Offentlig, Stat","Anlægsarbejde, byggeri","Middelalderbykerne","National betydning","50 % fremdrift af feltarbejde (Budget på mellem  500.000 og 3.000.000 kr. inkl. moms)","Museet har akut behov for styrelsens stillingtagen (Svar ønskes inden for 7 hverdage)","Assens Kommune"]
["Offentlig, Region","Anlægsarbejde, byggemodning","Mose, vådområder el. lign","International betydning","25 % fremdrift af feltarbejde (Budget på mellem 3.000.000 og 10.000.000 kr. inkl. moms)",null,"Ballerup Kommune"]
["Offentlig, Kommune","Anlægsarbejde, vej","Skov","Tidligere udpeget in situ areal","50 % fremdrift af feltarbejde (Budget på mellem 3.000.000 og 10.000.000 kr. inkl. moms)",null,"Billund Kommune"]
["Offentlig, Kommunal virksomhed","Anlægsarbejde, tracé","Andet, se faglig argumentation",null,"75 % fremdrift af feltarbejde (Budget på mellem 3.000.000 og 10.000.000 kr. inkl. moms)",null,"Bornholms Regionskommune"]
["Museet er selv bygherre","Dyrkning",null,null,"Sag med budgetbeløb på over 10.000.000 inkl. moms, afrapportering efter særaftale",null,"Brøndby Kommune"]
[null,"Erosion",null,null,"Årlig statusrapport",null,"Brønderslev Kommune"]
[null,"Læhegn",null,null,"Anmodning om anvisning af tilskud eller bevilling",null,"Dragør Kommune"]
[null,"Naturgenopretning",null,null,null,null,"Egedal Kommune"]
[null,"Råstofindvinding",null,null,null,null,"Esbjerg Kommune"]
[null,"Salg af jord",null,null,null,null,"Fanø Kommune"]
[null,"Skovrejsning",null,null,null,null,"Favrskov Kommune"]
[null,"Skovrejsning, med tilskud",null,null,null,null,"Faxe Kommune"]
[null,null,null,null,null,null,"Fredensborg Kommune"]
[null,null,null,null,null,null,"Fredericia Kommune"]
[null,null,null,null,null,null,"Frederiksberg Kommune"]
[null,null,null,null,null,null,"Frederikshavn Kommune"]
[null,null,null,null,null,null,"Frederikssund Kommune"]
[null,null,null,null,null,null,"Furesø Kommune"]
[null,null,null,null,null,null,"Faaborg-Midtfyn Kommune"]
[null,null,null,null,null,null,"Gentofte Kommune"]
[null,null,null,null,null,null,"Gladsaxe Kommune"]
[null,null,null,null,null,null,"Glostrup Kommune"]
[null,null,null,null,null,null,"Greve Kommune"]
[null,null,null,null,null,null,"Gribskov Kommune"]
[null,null,null,null,null,null,"Guldborgsund Kommune"]
[null,null,null,null,null,null,"Haderslev Kommune"]
[null,null,null,null,null,null,"Halsnæs Kommune"]
[null,null,null,null,null,null,"Hedensted Kommune"]
[null,null,null,null,null,null,"Helsingør Kommune"]
[null,null,null,null,null,null,"Herlev Kommune"]
[null,null,null,null,null,null,"Herning Kommune"]
[null,null,null,null,null,null,"Hillerød Kommune"]
[null,null,null,null,null,null,"Hjørring Kommune"]
[null,null,null,null,null,null,"Holbæk Kommune"]
[null,null,null,null,null,null,"Holstebro Kommune"]
[null,null,null,null,null,null,"Horsens Kommune"]
[null,null,null,null,null,null,"Hvidovre Kommune"]
[null,null,null,null,null,null,"Høje-Taastrup Kommune"]
[null,null,null,null,null,null,"Hørsholm Kommune"]
[null,null,null,null,null,null,"Ikast-Brande Kommune"]
[null,null,null,null,null,null,"Ishøj Kommune"]
[null,null,null,null,null,null,"Jammerbugt Kommune"]
[null,null,null,null,null,null,"Kalundborg Kommune"]
[null,null,null,null,null,null,"Kerteminde Kommune"]
[null,null,null,null,null,null,"Kolding Kommune"]
[null,null,null,null,null,null,"Københavns Kommune"]
[null,null,null,null,null,null,"Køge Kommune"]
[null,null,null,null,null,null,"Langeland Kommune"]
[null,null,null,null,null,null,"Lejre Kommune"]
[null,null,null,null,null,null,"Lemvig Kommune"]
[null,null,null,null,null,null,"Lolland Kommune"]
[null,null,null,null,null,null,"Lyngby-Taarbæk Kommune"]
[null,null,null,null,null,null,"Læsø Kommune"]
[null,null,null,null,null,null,"Mariagerfjord Kommune"]
[null,null,null,null,null,null,"Middelfart Kommune"]
[null,null,null,null,null,null,"Morsø Kommune"]
{"$rows_left_out":41}
{"sheet":"Logoer","index":8,"n_rows":34,"n_cols":9,"rows_kept":34,"cut":false,"hidden":true,"merged":[]}
["MuseumsLogo","Museum","Logo_ref"]
[null,"Vælg","Logoer!a2"]
[null,"ARKVEST, Arkæologi Vestjylland","Logoer!a3",null,null,null,null,null,{"$f":"VLOOKUP('2. Stamoplysninger'!E13,$B$2:$C$34,2,FALSE)","v":"Logoer!a2"}]
[null,"Arkæologi Sydfyn, Langelands Museum","Logoer!a4",null,null,null,null,null,{"$f":"VLOOKUP(H4,$B$2:$C$34,2,FALSE)","v":{"$error":"#N/A"}}]
[null,"Arkæologi Sydfyn, Svendborg Museum","Logoer!a5"]
[null,"Arkæologi Sydfyn, Øhavsmuseet Faaborg","Logoer!a6"]
[null,"Arkæologi Sydfyn, Østfynske Museer","Logoer!a7"]
[null,"Bornholms Museum","Logoer!a8"]
[null,"De Kulturhistoriske Museer i Holstebro","Logoer!a9"]
[null,"Horsens Museum","Logoer!a10",null,null,5]
[null,"Kroppedal Museum","Logoer!a11"]
[null,"Københavns Museum","Logoer!a12"]
[null,"MOMU, Moesgaard Museum","Logoer!a13"]
[null,"Museet Sønderskov","Logoer!a14"]
[null,"Museum Lolland Falster","Logoer!a15"]
[null,"Museum Midtjylland","Logoer!a16"]
[null,"Museum Nordsjælland","Logoer!a17"]
[null,"Museum Salling","Logoer!a18"]
[null,"Museum Silkeborg","Logoer!a19"]
[null,"Museum Skanderborg","Logoer!a20"]
[null,"Museum Sydøstdanmark","Logoer!a21"]
[null,"Museum Sønderjylland","Logoer!a22"]
[null,"Museum Thy","Logoer!a23"]
[null,"Museum Vestsjælland","Logoer!a24"]
[null,"Museum Østjylland","Logoer!a25"]
[null,"Nordjyske Museer","Logoer!a26"]
[null,"Museum Odense","Logoer!a27"]
[null,"ROMU, Roskilde Museum","Logoer!a28"]
[null,"Sydvestjyske Museer","Logoer!a29"]
[null,"Vejle Museerne","Logoer!a30"]
[null,"Vendsyssel Historiske Museum","Logoer!a31"]
[null,"Vesthimmerlands Museum","Logoer!a32"]
[null,"Viborg Museum","Logoer!a33"]
[null,"-","Logoer!a34"]