{"text_format":"1","workbook":"xlsx","n_sheets":9,"sheets":["1. Vejledning","2. Stamoplysninger","3. Budget","4. Regnskab","5. Redegørelse","6. Statusrapport","7.Delbudget (bilag)","Data","Logoer"],"not_rendered":{"charts":0,"images":36,"macros":1,"external_links":0,"defined_names":53,"comments":2,"pivot_tables":0},"unopened":[],"bounds":{"document_bytes":16777216,"sheet_cells":100000,"rows_first":2000,"rows_last":500,"rows_between":2000,"halvings":0,"cell_chars":16384,"cell_head_chars":4096},"cells_cut":0,"cells_raw":0,"read":"whole","date_system":"1900"}

{"sheet":"1. Vejledning","index":0,"n_rows":25,"n_cols":4,"rows_kept":25,"cut":false,"hidden":false,"merged":[]}
[]
["KORT VEJLEDNING I BRUG AF SKEMAET"]
[]
[null,"Introduktion"]
[]
[null,"2. Stamoplysninger"]
[]
[null,"3. Budget"]
[]
[null,"4. Regnskab"]
[]
[null,"5. Redegørelse"]
[]
[null,"6. Statusrapport"]
[]
[null,"7. Delbudget (bilag)"]
[]
[]
[]
[]
[]
[]
[]
[]
[null,null,null,"Version 1.01 gældende fra 08-04-2019"]

{"sheet":"2. Stamoplysninger","index":1,"n_rows":60,"n_cols":6,"rows_kept":60,"cut":false,"hidden":false,"merged":[]}
[null,null,null,null,null," "]
[null,"STAMOPLYSNINGER, FORUNDERSØGELSE I FORM AF OVERVÅGNING"]
[]
[null,null,"Stedoplysninger",null,"(udfyld her)"]
[null,null,null,"Systemnr. fra Fund og Fortidsminder"," "]
[]
[null,null,null,"Lokalitetsnavn"," "]
[null,null,null,"Sted- og lok. nr."," "]
[null,null,null,"Kommune"]
[null,null,null,"Museets journalnummer"," "]
[null,null,null,"Museum","Vælg","˅"]
[]
[null,null,null,"Styrelsens j. nr. oplyses ved afgørelsen"," "]
[]
[null,null,"Til beregning af udgifter"]
[null,null,null,"Måleenheder","Kubikmeter (m³) ","˅"]
[]
[null,null,null,{"$f":"IF(F22=\"m³\",\"Varighed af overvågning (typisk bylag)\",\"Varighed af overvågning (åbent land)\")","v":"Varighed af overvågning (typisk bylag)"},0,"timer"]
[null,null,null,"Arbejdsdagens gennemsnitlige varighed",7.4,"timer"]
[null,null,null,"Antal feltdage",{"$f":"ROUNDUP(E18/E19,0)","v":0},"dage"]
[]
[null,null,null,{"$f":"IF(F22=\"m³\",\"Lag som skal overvåges (typisk bylag)\",\"Flade som skal overvåges (åbent land)\")","v":"Lag som skal overvåges (typisk bylag)"},0,{"$f":"IF(E16=\"Kubikmeter (m³) \",\"m³\",\"m²\")","v":"m³"}]
[null,null,null,"Ekstra bemanding pr. dag",1]
[]
[null,null,"Landskab"]
[null,null,null,"Kulturarvsareal","Vælg","˅"]
[null,null,null,"Topografi","Vælg","˅"]
[]
[null,null,"Identifikation af bygherre"]
[null,null,null,"Bygherretype","Vælg","˅"]
[]
[null,null,null,"CVR-nummer"]
[null,null,null,"P-nummer"]
[null,null,null,"Navn virksomhed/person"," "]
[]
[null,null,null,"Vejnavn og nr."," "]
[null,null,null,"Postnummer og by"," "]
[null,null,null,"Land"," "]
[null,null,null,"Telefon"]
[null,null,null,"e-mail"]
[]
[null,null,"Bygherres kontaktperson"]
[null,null,null,"CVR-nummer"]
[null,null,null,"P-nummer"]
[null,null,null,"Navn virksomhed/person"," "]
[]
[null,null,null,"Vejnavn og nr."," "]
[null,null,null,"Postnummer og by"," "]
[null,null,null,"Land"," "]
[null,null,null,"Telefon"]
[null,null,null,"e-mail"]
[]
[]
[null,null,"Øvrige oplysninger"]
[null,null,null,"Årsag","Vælg","˅"]
[null,null,null,"Bygherres samlede projektareal"]
[null,null,null,"Bygherres samlede økonomiske ramme",null,"kr. inkl. moms"]
[]
[]
[null,null,"Besked til sagsbehandler vedr. budgettet"]

{"sheet":"3. Budget","index":2,"n_rows":94,"n_cols":9,"rows_kept":94,"cut":false,"hidden":false,"merged":[]}
["BUDGET FOR STØRRE ARKÆOLOGISK FORUNDERSØGELSE"]
["I FORM AF OVERVÅGNING AF JORDARBEJDE"]
[{"$f":"'2. Stamoplysninger'!E7","v":" "}]
[{"$f":"'2. Stamoplysninger'!E11","v":"Vælg"}]
["Museet j. nr. ",null,{"$f":"'2. Stamoplysninger'!E10","v":" "}]
["Sted- lok. nr.",null,{"$f":"'2. Stamoplysninger'!E8","v":" "}]
["SLKS j. nr.",null,{"$f":"'2. Stamoplysninger'!E13","v":" "}]
[null,null," "]
["Bygherre:",null,{"$f":"IF('2. Stamoplysninger'!E32>0,'2. Stamoplysninger'!E32,'2. Stamoplysninger'!E34)","v":" "}]
[null,null,{"$f":"'2. Stamoplysninger'!E36","v":" "}]
[null,null,{"$f":"'2. Stamoplysninger'!E37","v":" "}]
[]
["I.  Feltarbejde",null,null,null,"(udfyld her)","(udfyld her)"]
[null,"1.","Felttimer",null,"Antal","á kr."]
[null,null,"Ansvarlig udgravningsleder",null,{"$f":"IF(OR(SUM(E16:E20)>110,E16=0),SUM(E16:E20)*0.05,5)","v":0},510,"=",{"$f":"E15*F15","v":0},"kr."]
[null,null,"Daglig udgravningsleder",null,{"$f":"'2. Stamoplysninger'!E18","v":0},430,"=",0,"kr."]
[null,null,"Akademisk medarbejder",null,{"$f":"'2. Stamoplysninger'!E18*'2. Stamoplysninger'!E23","v":0},415,"=",0,"kr."]
[null,null,"Studentermedhjælper",null,0,270,"=",0,"kr."]
[null,null,"Museumstekniker",null,0,375,"=",0,"kr."]
[null,null,"Arbejdsmand",null,0,285,"=",0,"kr."]
[null,null,"Felttimesum i alt",null,null,null,null,{"$f":"SUM(H15:H20)","v":0},"kr."]
[]
[null,"2.","Eksterne specialister",null,"Antal","á kr."]
[null,null,"Specialist",null,0,0,"=",{"$f":"E24*F24","v":0},"kr."]
[null,null,"Landmåler",null,0,0,"=",{"$f":"E25*F25","v":0},"kr."]
[null,null,"Øvrigt feltarbejde i alt",null,null,null,null,{"$f":"SUM(H24:H25)","v":0},"kr."]
[]
["II. Dokumentation og tilgængeliggørelse"]
[null,"1.","Arkæologisk beretning og kulturhistorisk"]
[null,null," rapport samt indføring og magasinering"]
[null,null,null,null,null,0.2,"=",{"$f":"IF(OR(Felttimesum>F16*25,Felttimesum=0),H21*F31,F16*5)","v":0},"kr."]
[null,null,"Dokumentation i alt",null,null,null,null,{"$f":"SUM(H31)","v":0},"kr."]
[]
["III.  Personale- og transportudgifter"]
[null,"1.","Transport",null,"Km","á kr."]
[null,null,"Kørselsgodtgørelse",null,0,0,"=",{"$f":"E36*F36","v":0},"kr."]
[null,null,"Rejsegodtgørelse",null,0,0,"=",{"$f":"E37*F37","v":0},"kr."]
[null,null,"Transport i alt",null,null,null,null,{"$f":"SUM(H36:H37)","v":0},"kr."]
[]
[null,"2.","Kørsel",null,"Km pr. dag","á kr."]
[null,null,"Kørsel i museets/privatbil",null,0,3.56,"=",{"$f":"'2. Stamoplysninger'!E20*E41*F41","v":0},"kr."]
[null,null,"Lejet bil",null,0,0,"=",{"$f":"E42*F42","v":0},"kr."]
[null,null,"Transport til arbejdsplads (arbejdstid)",null,0,0,"=",{"$f":"E43*F43","v":0},"kr."]
[null,null,"Kørsel i alt",null,null,null,null,{"$f":"SUM(H41:H43)","v":0},"kr."]
[]
[null,"3.","Diæter og timepenge",null,"Antal dage","á kr."]
[null,null,"Dagdiæter",null,0,0,"=",{"$f":"E47*F47","v":0},"kr."]
[null,null,"Natdiæter",null,0,0,"=",{"$f":"E48*F48","v":0},"kr."]
[null,null,"Timepenge/felttillæg",null,{"$f":"'2. Stamoplysninger'!E20","v":0},0,"=",{"$f":"E49*F49","v":0},"kr."]
[null,null,"Diæter og timepenge i alt",null,null,null,null,{"$f":"SUM(H47:H49)","v":0},"kr."]
[]
["IV. Øvrige udgifter"]
[null,"1.","Skurvogn og lign.",null,"Antal","á kr."]
[null,null,"Leje inkl. Drift",null,{"$f":"'2. Stamoplysninger'!E20","v":0},600,"=",{"$f":"E54*F54","v":0},"kr."]
[null,null,"Transport",null,{"$f":"IF(E54>0,2,0)","v":0},500,"=",{"$f":"E55*F55","v":0},"kr."]
[null,null,"Skurvogn inkl. transport i alt ",null,null,null,null,{"$f":"SUM(H54:H55)","v":0},"kr."]
[]
[null,"2.","Materialer og særligt udstyr",null,"Antal","á kr."]
[null,null,"Opmålingsudstyr",null,{"$f":"'2. Stamoplysninger'!E20","v":0},300,"=",{"$f":"E59*F59","v":0},"kr."]
[null,null,"Sold",null,0,0,"=",{"$f":"E60*F60","v":0},"kr."]
[null,null,"El, vand, brændstof, pumper eller lign.",null,0,0,"=",{"$f":"E61*F61","v":0},"kr."]
[null,null,"…",null,0,0,"=",{"$f":"E62*F62","v":0},"kr."]
[null,null,"…",null,0,0,"=",{"$f":"E63*F63","v":0},"kr."]
[null,null,"Materialer og særligt udstyr i alt",null,null,null,null,{"$f":"SUM(H59:H63)","v":0},"kr."]
[]
["V. Uforudsete udgifter"]
[null,"1.","Uforudsete udgifter"]
[null,null,null,null,null,0.1,"=",{"$f":"SUM(H21+H26+H32+H38+H50+H56+H64+H44+H71)*F68","v":0},"kr."]
[null,null,"Uforudsete udgifter i alt",null,null,null,null,{"$f":"SUM(H68)","v":0},"kr."]
[]
[]
[]
["Udgifter i alt eksklusiv moms",null,null,null,null,null,"=",{"$f":"H21+H26+H32+H38+H50+H56+H64+H44+H69","v":0},"kr."]
[]
[null,null,"moms",null,null,null,"=",{"$f":"H73*0.25","v":0},"kr."]
["Udgifter i alt inklusiv moms",null,null,null,null,null,"=",{"$f":"SUM(H73,H75)","v":0},"kr."]
[null,null,null,null,null,null,null,{"$f":"IFERROR(H76/'2. Stamoplysninger'!E22,\"0\")","v":"0"},{"$f":"IF('2. Stamoplysninger'!E16=\"Kvadratmeter (m²) \",\"kr/m²\",\"kr/m³\")","v":"kr/m³"}]
[]
["VI. Udgifter til vinterforanstaltninger"]
[]
{"$rows_left_out":15}
{"sheet":"4. Regnskab","index":3,"n_rows":135,"n_cols":9,"rows_kept":135,"cut":false,"hidden":false,"merged":[]}
["REGNSKAB FOR STØRRE ARKÆOLOGISK FORUNDERSØGELSE"]
["I FORM AF OVERVÅGNING AF JORDARBEJDE"]
[{"$f":"'2. Stamoplysninger'!E7","v":" "}]
[{"$f":"'2. Stamoplysninger'!E11","v":"Vælg"}]
["Museet j. nr. ",null,{"$f":"'2. Stamoplysninger'!E10","v":" "}]
["Sted- lok. nr.",null,{"$f":"'2. Stamoplysninger'!E8","v":" "}]
["SLKS j. nr.",null,{"$f":"'2. Stamoplysninger'!E13","v":" "}]
[]
["Bygherre:",null,{"$f":"IF('2. Stamoplysninger'!E32>0,'2. Stamoplysninger'!E32,'2. Stamoplysninger'!E34)","v":" "},null,null,"Endeligt areal",null,0,{"$f":"'2. Stamoplysninger'!F22","v":"m³"}]
[null,null,{"$f":"'2. Stamoplysninger'!E36","v":" "},null,null,"Efterfølgende beretning",null,"Nej","˅"]
[null,null,{"$f":"'2. Stamoplysninger'!E37","v":" "}]
[null,null,null,null,"NB! Regnskabsaflæggelse ift. styrelsen, ikke faktura"]
["I.  Feltarbejde",null,null,null,"(udfyld her)","(udfyld her)"]
[null,"1.","Felttimer",null,"Antal","á kr."]
[null,null,{"$f":"'3. Budget'!C15","v":"Ansvarlig udgravningsleder"},null,0,0,"=",{"$f":"E15*F15","v":0},"kr."]
[null,null,{"$f":"'3. Budget'!C16","v":"Daglig udgravningsleder"},null,0,0,"=",0,"kr."]
[null,null,{"$f":"'3. Budget'!C17","v":"Akademisk medarbejder"},null,0,0,"=",0,"kr."]
[null,null,{"$f":"'3. Budget'!C18","v":"Studentermedhjælper"},null,0,0,"=",0,"kr."]
[null,null,{"$f":"'3. Budget'!C19","v":"Museumstekniker"},null,0,0,"=",0,"kr."]
[null,null,{"$f":"'3. Budget'!C20","v":"Arbejdsmand"},null,0,0,"=",0,"kr."]
[null,null,"…",null,0,0,"=",0,"kr."]
[null,null,"…",null,0,0,"=",0,"kr."]
[null,null,"…",null,0,0,"=",0,"kr."]
[null,null,"…",null,0,0,"=",0,"kr."]
[null,null,"Felttimesum i alt",null,null,null,null,{"$f":"SUM(H15:H24)","v":0},"kr."]
[]
[null,"2.","Eksterne specialister",null,"Antal","á kr."]
[null,null,"Specialist",null,0,0,"=",{"$f":"E28*F28","v":0},"kr."]
[null,null,"Landmåler",null,0,0,"=",{"$f":"E29*F29","v":0},"kr."]
[null,null,"Øvrigt feltarbejde i alt",null,null,null,null,{"$f":"SUM(H28:H29)","v":0},"kr."]
[]
["II. Dokumentation og tilgængeliggørelse"]
[null,"1.","Arkæologisk beretning og kulturhistorisk"]
[null,null," rapport samt indføring og magasinering",null,"Timer"]
[null,null,null,null,null,{"$f":"'3. Budget'!F31","v":0.2},"=",{"$f":"IF(AND(H10=\"Ja\",H25<Felttimesum),H25*'3. Budget'!F31,IF(AND(H10=\"Ja\",H25>Felttimesum),Rapport,0))","v":0},"kr."]
[null,null,"Dokumentation i alt",null,null,null,null,{"$f":"SUM(H35)","v":0},"kr."]
[]
["III.  Personale- og transportudgifter"]
[null,"1.","Transport",null,"Km","á kr."]
[null,null,"Kørselsgodtgørelse",null,0,0,"=",{"$f":"E40*F40","v":0},"kr."]
[null,null,"Rejsegodtgørelse",null,0,0,"=",{"$f":"E41*F41","v":0},"kr."]
[null,null,"Transport i alt",null,null,null,null,{"$f":"SUM(H40:H41)","v":0},"kr."]
[]
[null,"2.","Kørsel",null,"Km pr. dag","á kr."]
[null,null,"Kørsel i museets/privatbil",null,0,0,"=",{"$f":"E45*F45","v":0},"kr."]
[null,null,"Lejet bil",null,0,0,"=",{"$f":"E46*F46","v":0},"kr."]
[null,null,"Transport til arbejdsplads (arbejdstid)",null,0,0,"=",{"$f":"E47*F47","v":0},"kr."]
[null,null,"Kørsel i alt",null,null,null,null,{"$f":"SUM(H45:H47)","v":0},"kr."]
[]
[null,"3.","Diæter og timepenge",null,"Antal dage","á kr."]
[null,null,"Dagdiæter",null,0,0,"=",{"$f":"E51*F51","v":0},"kr."]
[null,null,"Natdiæter",null,0,0,"=",{"$f":"E52*F52","v":0},"kr."]
[null,null,"Timepenge/felttillæg",null,0,0,"=",{"$f":"E53*F53","v":0},"kr."]
[null,null,"Diæter og timepenge i alt",null,null,null,null,{"$f":"SUM(H51:H53)","v":0},"kr."]
[]
["IV. Øvrige udgifter"]
[null,"1.","Skurvogn og lign.",null,"Antal","á kr."]
[null,null,"Leje inkl. Drift",null,0,0,"=",{"$f":"E58*F58","v":0},"kr."]
[null,null,"Transport",null,0,0,"=",{"$f":"E59*F59","v":0},"kr."]
[null,null,"Skurvogn inkl. transport i alt ",null,null,null,null,{"$f":"SUM(H58:H59)","v":0},"kr."]
[]
[null,"2.","Materialer og særligt udstyr",null,"Antal","á kr."]
[null,null,{"$f":"'3. Budget'!C59","v":"Opmålingsudstyr"},null,0,0,"=",{"$f":"E63*F63","v":0},"kr."]
[null,null,{"$f":"'3. Budget'!C60","v":"Sold"},null,0,0,"=",{"$f":"E64*F64","v":0},"kr."]
[null,null,{"$f":"'3. Budget'!C61","v":"El, vand, brændstof, pumper eller lign."},null,0,0,"=",{"$f":"E65*F65","v":0},"kr."]
[null,null,{"$f":"'3. Budget'!C62","v":"…"},null,0,0,"=",{"$f":"E66*F66","v":0},"kr."]
[null,null,{"$f":"'3. Budget'!C63","v":"…"},null,0,0,"=",{"$f":"E67*F67","v":0},"kr."]
[null,null,"Materialer og særligt udstyr i alt",null,null,null,null,{"$f":"SUM(H63:H67)","v":0},"kr."]
[]
["V. Uforudsete udgifter"]
[null,"1.","Uforudsete udgifter"]
[null,null,null,null,null,{"$f":"'3. Budget'!F68","v":0.1},"=",0,"kr."]
[null,null,"Uforudsete udgifter i alt",null,null,null,null,{"$f":"SUM(H72)","v":0},"kr."]
[]
["VI. Udgifter til vinterforanstaltninger"]
[]
[null,"1.","Udgifter til vinterforanstaltninger",null,"Antal","á kr."]
[null,null,{"$f":"'3. Budget'!C83","v":"…"},null,0,0,"=",{"$f":"E78*F78","v":0},"kr."]
[null,null,{"$f":"'3. Budget'!C84","v":"…"},null,0,0,"=",{"$f":"E79*F79","v":0},"kr."]
[null,null,{"$f":"'3. Budget'!C85","v":"…"},null,0,0,"=",{"$f":"E80*F80","v":0},"kr."]
{"$rows_left_out":56}
{"sheet":"5. Redegørelse","index":4,"n_rows":22,"n_cols":8,"rows_kept":22,"cut":false,"hidden":false,"merged":[]}
[]
[null,"REGNSKABSREDEGØRELSE"]
[null,null,null,"Budget","Regnskab","Diskrepans"]
[null,"Areal m²/m³:",null,{"$f":"'2. Stamoplysninger'!E22","v":0},{"$f":"'4. Regnskab'!H9","v":0},{"$f":"D4-E4","v":0},null,{"$f":"IF(OR(E4>D4*1.1,E4<D4*0.9),\"Vær opmærksom på, at arealet afviger mere end 10 %\",\"Ok\")","v":"Ok"}]
[]
[null,"I.  Feltarbejde",null,{"$f":"SUM(Felttimesum,Specialister)","v":0},{"$f":"SUM('4. Regnskab'!H25,'4. Regnskab'!H30)","v":0},{"$f":"D6-E6","v":0},null,{"$f":"IF(OR(E6>D6*1.2,E6<D6*0.8),\"Vær opmærksom på, at  afvigelsen overstiger 20%\",\"Ok\")","v":"Ok"}]
[]
[null,"II. Dokumentation og tilgængeliggørelse",null,{"$f":"Rapport","v":0},{"$f":"'4. Regnskab'!H36","v":0},{"$f":"D8-E8","v":0},null,{"$f":"IF(OR('4. Regnskab'!H36>Rapport*1.2,'4. Regnskab'!H36<Rapport*0.8),\"Vær opmærksom på, at  afvigelsen overstiger 20%\",\"Ok\")","v":"Ok"}]
[]
[null,"III.  Personale- og transportudgifter",null,{"$f":"SUM(Transport_PersonaleKm,Kørsel,DiætTimepege)","v":0},{"$f":"SUM('4. Regnskab'!H42,'4. Regnskab'!H48,'4. Regnskab'!H54)","v":0},{"$f":"D10-E10","v":0},null,{"$f":"IF(OR(E10>D10*1.2,E10<D10*0.8),\"Vær opmærksom på, at  afvigelsen overstiger 20%\",\"Ok\")","v":"Ok"}]
[]
[null,"IV. Øvrige udgifter",null,{"$f":"SUM(Skurvogn,'3. Budget'!H64)","v":0},{"$f":"SUM('4. Regnskab'!H60,'4. Regnskab'!H68)","v":0},{"$f":"D12-E12","v":0},null,{"$f":"IF(OR(E12>D12,D12*1.2,E12<D12*0.8),\"Vær opmærksom på, at  afvigelsen overstiger 20%\",\"Ok\")","v":"Ok"}]
[]
[null,"V. Uforudsete udgifter",null,{"$f":"Diverse","v":0},{"$f":"'4. Regnskab'!H73","v":0},{"$f":"D14-E14","v":0},null,{"$f":"IF('4. Regnskab'!H73>0,\"Er der godkendt forbrug af denne budgetpost?\",\"Ok\")","v":"Ok"}]
[]
[null,"VI. Udgifter til vinterforanstaltninger",null,{"$f":"'3. Budget'!H88","v":0},{"$f":"'4. Regnskab'!H83","v":0},{"$f":"D16-E16","v":0},null,{"$f":"IF(E16>0,\"Er der godkendt forbrug af denne budgetpost?\",\"Ok\")","v":"Ok"}]
[]
[null,"VI. Værdi af faciliteter stillet til rådighed af bygherre",null,0,{"$f":"'4. Regnskab'!H98","v":0},{"$f":"D18-E18","v":0},null,{"$f":"IF(E18>D12-E12,\"Beløb overstiger budgetpost IV. Øvrige udgifter\",\"Ok\")","v":"Ok"}]
[]
[null,"Sum ekskl. vinter, inkl. moms",null,{"$f":"'3. Budget'!H76","v":0},{"$f":"'4. Regnskab'!H100-('4. Regnskab'!H83*1.25)","v":0},{"$f":"D20-E20","v":0},null,{"$f":"IF(OR('4. Regnskab'!H100>'3. Budget'!H93,'4. Regnskab'!H100<'3. Budget'!H93*0.8),\"Afvigelse, udfyld skema!\",\"Ok\")","v":"Ok"}]
[]
[null,"Afvigelsesforklaring:",null,null,null,null,null,{"$f":"IF('4. Regnskab'!H10=\"Ja\",\"NB! Husk at vedhæfte dokumentation for endelig afregning med efterfølgende beretningskrivning.\",\"\")","v":""}]

{"sheet":"6. Statusrapport","index":5,"n_rows":78,"n_cols":5,"rows_kept":78,"cut":false,"hidden":false,"merged":[[4,3,5,8]]}
[null,null,null,{"$f":"IF(D14=\"Museet har akut behov for styrelsens stillingtagen (Svar ønskes inden for 7 hverdage)\",\"HASTER!\",\"\")","v":""}]
["STATUSRAPPORT, STØRRE ARKÆOLOGISK FORUNDERSØGELSE"]
["I FORM AF OVERVÅGNING AF JORDARBEJDE"]
[{"$f":"'3. Budget'!A3","v":" "}]
[{"$f":"'2. Stamoplysninger'!E11","v":"Vælg"}]
["Museet j. nr. ",null,{"$f":"'2. Stamoplysninger'!E10","v":" "}]
["Sted- lok. nr.",null,{"$f":"'2. Stamoplysninger'!$E$8","v":" "}]
["SLKS j. nr.",null,{"$f":"'2. Stamoplysninger'!E13","v":" "}]
["System nr.",null,{"$f":"'2. Stamoplysninger'!E5","v":" "}]
[null,null," "]
["Bygherre:",null,{"$f":"IF('2. Stamoplysninger'!E32>0,'2. Stamoplysninger'!E32,'2. Stamoplysninger'!E34)","v":" "},"Årsag til fremsendelse (udfyld her)"]
[null,null,{"$f":"'2. Stamoplysninger'!E37","v":" "},"Vælg","˅"]
[null,null,{"$f":"'2. Stamoplysninger'!E38","v":" "}]
["Godkendt budget inkl. moms",null,null,"Vælg","˅"]
[null,null,{"$f":"'3. Budget'!H76","v":0}]
[]
[null,"Begrundelse ved hasteanmodning"]
[]
[]
[]
[]
[]
[null,"Fremdrift og frigivelser"]
[null,null,{"$f":"IF(#REF!=\"Museet har akut behov for styrelsens stillingtagen i denne sag (inden for 7 hverdag)\",\"HASTER!\",\"\")","v":{"$error":"#REF!"}}]
[]
[]
[]
[]
[]
[]
[]
[]
[]
[]
[]
[]
[]
[]
[null,"Undersøgelsens foreløbige resultater og videre prioritering"]
[]
[]
[]
[]
[]
[]
[]
[]
[null,"NB! Kortbilag skal vedhæftes ved fremsendelse af mail."]
[]
[]
[]
[]
[]
[]
[]
[]
[]
[]
[]
[]
[]
[]
[]
[]
[]
[]
[]
[]
[]
[]
[]
[]
[]
[]
[]
[]
[]
[null,"NB! Kortbilag skal vedhæftes ved fremsendelse af mail til postfor@slks.dk"]

{"sheet":"7.Delbudget (bilag)","index":6,"n_rows":75,"n_cols":9,"rows_kept":75,"cut":false,"hidden":false,"merged":[]}
["BILAG TIL UNDERSØGELSE - DELBUDGET",null,null,null,null,null,null,1]
[{"$f":"'2. Stamoplysninger'!E7","v":" "}]
[{"$f":"'2. Stamoplysninger'!E11","v":"Vælg"}]
["Museet j. nr. ",null,{"$f":"'2. Stamoplysninger'!E10","v":" "}]
["Sted- lok. nr.",null,{"$f":"'2. Stamoplysninger'!E8","v":" "}]
["SLKS j. nr.",null,{"$f":"'2. Stamoplysninger'!E13","v":" "}]
[null,null," "]
["Bygherre:",null,{"$f":"IF('2. Stamoplysninger'!E32>0,'2. Stamoplysninger'!E32,'2. Stamoplysninger'!E34)","v":" "}]
[null,null,{"$f":"'2. Stamoplysninger'!E36","v":" "}]
[null,null,{"$f":"'2. Stamoplysninger'!E37","v":" "},null,null,"Delbudget vedrører",null,0,"m²"]
[]
["I.  Feltarbejde",null,null,null,"(udfyld her)","(udfyld her)"]
[null,"1.","Felttimer",null,"Antal","á kr."]
[null,null,"Ansvarlig udgravningsleder",null,0,0,"=",{"$f":"E14*F14","v":0},"kr."]
[null,null,"Daglig udgravningsleder",null,0,0,"=",{"$f":"E15*F15","v":0},"kr."]
[null,null,"Akademisk medarbejder",null,0,0,"=",0,"kr."]
[null,null,"Studentermedhjælper",null,0,0,"=",0,"kr."]
[null,null,"Museumstekniker",null,0,0,"=",0,"kr."]
[null,null,"Arbejdsmand",null,0,0,"=",0,"kr."]
[null,null,"Felttimesum i alt",null,null,null,null,{"$f":"SUM(H14:H19)","v":0},"kr."]
[]
[null,"2.","Eksterne specialister",null,"Antal","á kr."]
[null,null,"Specialist",null,0,0,"=",{"$f":"E23*F23","v":0},"kr."]
[null,null,"Landmåler",null,0,0,"=",{"$f":"E24*F24","v":0},"kr."]
[null,null,"Øvrigt feltarbejde i alt",null,null,null,null,{"$f":"SUM(H23:H24)","v":0},"kr."]
[]
["II. Dokumentation og tilgængeliggørelse"]
[null,"1.","Arkæologisk beretning og kulturhistorisk rapport mv. anføres på hovedbudget."]
[]
["III.  Personale- og transportudgifter"]
[null,"1.","Transport",null,"Km","á kr."]
[null,null,"Kørselsgodtgørelse",null,0,0,"=",{"$f":"E32*F32","v":0},"kr."]
[null,null,"Rejsegodtgørelse",null,0,0,"=",{"$f":"E33*F33","v":0},"kr."]
[null,null,"Transport i alt",null,null,null,null,{"$f":"SUM(H32:H33)","v":0},"kr."]
[]
[null,"2.","Kørsel",null,"Km","á kr."]
[null,null,"Kørsel i museets/privatbil",null,0,0,"=",{"$f":"E37*F37","v":0},"kr."]
[null,null,"Lejet bil",null,0,0,"=",{"$f":"E38*F38","v":0},"kr."]
[null,null,"Transport til arbejdsplads (arbejdstid)",null,0,0,"=",0,"kr."]
[null,null,"Kørsel i alt",null,null,null,null,{"$f":"SUM(H37:H39)","v":0},"kr."]
[]
[null,"3.","Diæter og timepenge",null,"Antal dage","á kr."]
[null,null,"Dagdiæter",null,0,0,"=",{"$f":"E43*F43","v":0},"kr."]
[null,null,"Natdiæter",null,0,0,"=",{"$f":"E44*F44","v":0},"kr."]
[null,null,"Timepenge/felttillæg",null,0,0,"=",0,"kr."]
[null,null,"Diæter og timepenge i alt",null,null,null,null,{"$f":"SUM(H43:H45)","v":0},"kr."]
[]
["IV. Øvrige udgifter"]
[null,"1.","Maskinkraft",null,"Antal timer","á kr."]
[null,null,"Afrømning",null,0,0,"=",{"$f":"E50*F50","v":0},"kr."]
[null,null,"Tildækning",null,0,0,"=",{"$f":"E51*F51","v":0},"kr."]
[null,null,"Transport",null,0,0,"=",0,"kr."]
[null,null,"Maskinkraft i alt",null,null,null,null,{"$f":"SUM(H50:H52)","v":0},"kr."]
[]
[null,"2.","Skurvogn og lign.",null,"Antal","á kr."]
[null,null,"Leje pr. dag",null,0,0,"=",{"$f":"E56*F56","v":0},"kr."]
[null,null,"Transport",null,0,0,"=",{"$f":"E57*F57","v":0},"kr."]
[null,null,"Skurvogn inkl. transport i alt ",null,null,null,null,{"$f":"SUM(H56:H57)","v":0},"kr."]
[]
[null,"3.","Materialer og særligt udstyr",null,"Antal","á kr."]
[null,null,"Opmålingsudstyr",null,0,0,"=",{"$f":"E61*F61","v":0},"kr."]
[null,null,"Sold",null,0,0,"=",{"$f":"E62*F62","v":0},"kr."]
[null,null,"El, vand, brændstof, pumper eller lign.",null,0,0,"=",0,"kr."]
[null,null,"…",null,0,0,"=",0,"kr."]
[null,null,"…",null,0,0,"=",0,"kr."]
[null,null,"…",null,0,0,"=",0,"kr."]
[null,null,"…",null,0,0,"=",0,"kr."]
[null,null,"Materialer og særligt udstyr i alt",null,null,null,null,{"$f":"SUM(H61:H67)","v":0},"kr."]
[]
["V. Uforudsete udgifter"]
[null,"1.","Uforudsete udgifter anføres på hovedbudget."]
[]
[]
["Udgifter i alt eksklusiv moms",null,null,null,null,null,"=",{"$f":"H68+H58+H53+H46+H40+H34+H25+H20","v":0},"kr."]
[null,null,null,null,null,null,null,{"$f":"IFERROR(H10/H74,\"0\")","v":"0"},{"$f":"IF(I10=\"m²\",\"kr/m²\",\"kr/m³\")","v":"kr/m²"}]

{"sheet":"Data","index":7,"n_rows":16,"n_cols":6,"rows_kept":16,"cut":false,"hidden":true,"merged":[]}
["Bygherretype","Anlægsarbejdets karakter","Landskab","Kulturarvsareal","Årsag til fremsendelse af statusskema","Ønske om dialog"]
["Vælg","Vælg","Vælg","Vælg","Vælg","Vælg"]
["Privat virksomhed f.eks. A/S, ApS, I/S, landbrug (med CVR nr.)","Andet, se faglig argumentation","Åbent land","Nej","Væsenligt ændret arkæologisk potentiale","Undersøgelsen forløber som planlagt (Se beskrivelse nedenfor)"]
["Privat person (uden CVR nr.)","Anlægsarbejde, andet","Bebygget areal","Regional betydning","Aktivering af vinterforanstaltninger","Museet anmoder om styrelsens vurdering (Svar ønskes)"]
["Offentlig, Stat","Anlægsarbejde, byggeri","Middelalderbykerne","National betydning","50 % fremdrift af feltarbejde (Budget på mellem  500.000 og 3.000.000 kr. inkl. moms)","Museet har akut behov for styrelsens stillingtagen (Svar ønskes inden for 7 hverdage)"]
["Offentlig, Region","Anlægsarbejde, byggemodning","Mose, vådområder el. lign","International betydning","25 % fremdrift af feltarbejde (Budget på mellem 3.000.000 og 10.000.000 kr. inkl. moms)"]
["Offentlig, Kommune","Anlægsarbejde, vej","Skov","Tidligere udpeget in situ areal","50 % fremdrift af feltarbejde (Budget på mellem 3.000.000 og 10.000.000 kr. inkl. moms)"]
["Offentlig, Kommunal virksomhed","Anlægsarbejde, tracé","Andet, se faglig argumentation",null,"75 % fremdrift af feltarbejde (Budget på mellem 3.000.000 og 10.000.000 kr. inkl. moms)"]
["Museet er selv bygherre","Dyrkning",null,null,"Sag med budgetbeløb på over 10.000.000 inkl. moms, afrapportering efter særaftale"]
[null,"Erosion",null,null,"Årlig statusrapport"]
[null,"Læhegn"]
[null,"Naturgenopretning"]
[null,"Råstofindvinding"]
[null,"Salg af jord"]
[null,"Skovrejsning"]
[null,"Skovrejsning, med tilskud"]

{"sheet":"Logoer","index":8,"n_rows":34,"n_cols":9,"rows_kept":34,"cut":false,"hidden":true,"merged":[]}
["MuseumsLogo","Museum","Logo_ref"]
[null,"Vælg","Logoer!a2"]
[null,"ARKVEST, Arkæologi Vestjylland","Logoer!a3",null,null,null,null,null,{"$f":"VLOOKUP('2. Stamoplysninger'!E11,$B$2:$C$34,2,FALSE)","v":"Logoer!a2"}]
[null,"Arkæologi Sydfyn, Langelands Museum","Logoer!a4",null,null,null,null,null,{"$f":"VLOOKUP(H4,$B$2:$C$34,2,FALSE)","v":{"$error":"#N/A"}}]
[null,"Arkæologi Sydfyn, Svendborg Museum","Logoer!a5"]
[null,"Arkæologi Sydfyn, Øhavsmuseet Faaborg","Logoer!a6"]
[null,"Arkæologi Sydfyn, Østfynske Museer","Logoer!a7"]
[null,"Bornholms Museum","Logoer!a8"]
[null,"De Kulturhistoriske Museer i Holstebro","Logoer!a9"]
[null,"Horsens Museum","Logoer!a10",null,null,5]
[null,"Kroppedal Museum","Logoer!a11"]
[null,"Københavns Museum","Logoer!a12"]
[null,"MOMU, Moesgaard Museum","Logoer!a13"]
[null,"Museet på Koldinghus","Logoer!a14"]
[null,"Museet på Sønderskov","Logoer!a15"]
[null,"Museum Lolland Falster","Logoer!a16"]
[null,"Museum Midtjylland","Logoer!a17"]
[null,"Museum Nordsjælland","Logoer!a18"]
[null,"Museum Salling","Logoer!a19"]
[null,"Museum Silkeborg","Logoer!a20"]
[null,"Museum Skanderborg","Logoer!a21"]
[null,"Museum Sydøstdanmark","Logoer!a22"]
[null,"Museum Sønderjylland","Logoer!a23"]
[null,"Museum Thy","Logoer!a24"]
[null,"Museum Vestsjælland","Logoer!a25"]
[null,"Museum Østjylland","Logoer!a26"]
[null,"Nordjyllands Historiske Museum","Logoer!a27"]
[null,"Odense Bys Museer","Logoer!a28"]
[null,"ROMU, Roskilde Museum","Logoer!a29"]
[null,"Sydvestjyske Museer","Logoer!a30"]
[null,"Vejle Museerne","Logoer!a31"]
[null,"Vendsyssel Historiske Museum","Logoer!a32"]
[null,"Vesthimmerlands Museum","Logoer!a33"]
[null,"Viborg Museum","Logoer!a34"]